program: Gaussian 09
title: 000087874
version: EM64L-G09RevD.01
frameworkgroup: C1[X(C9H12O2)]
method: RPBEPBE
basis: SDD
operation: Freq
keyword: #pfreq=noraman
keyword: PBEPBE/SDD
title: #p freq=noraman PBEPBE/SDD
converged: YES YES NO NO
title: Mulliken charges:
elementType: O O C C C C C C C C C H H H H H H H H H H H H
charge: -0.426824 -0.437362 -0.586017 0.392738 -0.355423 0.126236 -0.378472 -0.680954 -0.521867 -0.385903 0.319477 0.232586 0.189817 0.205951 0.223405 0.232644 0.214141 0.205409 0.224957 0.242590 0.249463 0.359677 0.353730
chargesum: 0.00000
title: Mulliken charges with hydrogens summed into heavy atoms:
elementType: O O C C C C C C C C C
charge: -0.067146 -0.083632 -0.163614 0.392738 0.073934 0.126236 -0.145828 -0.036447 -0.279277 -0.136441 0.319477
polarizability: 1.44766770e+02 1.68568571e+00 1.05245861e+02 -8.46742644e+00 2.67419761e+00 6.10793069e+01
1716.lowfreq: -16.2487 -0.0012 -0.0008 -0.0008 4.9046 6.6338 55.4634 72.2832 91.7908
frequency: 55.2839 72.2757 91.7080 188.3789 222.2172 230.0217 277.5822 307.1925 313.3689 322.4291 348.6886 380.2833 451.5509 477.2236 517.4512 549.9656 613.5556 709.5151 724.2463 737.4417 773.1041 812.9752 837.5590 859.0005 886.9128 942.0681 945.6802 1042.1972 1051.0970 1092.5393 1111.3482 1128.1762 1144.5967 1173.4465 1214.9351 1223.3036 1264.3556 1276.3275 1291.7799 1316.2706 1337.8965 1390.7124 1400.6737 1446.6931 1474.0001 1477.8496 1481.1645 1496.2261 1499.8222 1601.7736 1639.4856 2927.5239 2972.7105 2976.8643 3017.2451 3037.8936 3069.1453 3076.1876 3126.6763 3143.3260 3178.1424 3582.4324 3583.6437
redmass: 3.6921 3.7710 1.6967 4.1560 3.8951 1.2179 3.3814 2.4253 1.2373 4.2844 1.1117 3.9661 2.9454 3.6877 5.7096 5.1112 4.0306 3.1622 4.6449 1.1929 2.9044 1.5453 1.7414 1.2701 1.9673 1.3418 3.7410 1.7454 2.4627 2.1225 1.8317 1.4869 1.2717 1.5498 1.4577 1.6737 1.6461 1.3434 1.3669 1.9287 1.5046 1.2158 4.5565 2.9774 1.0586 1.0641 1.1145 1.1560 2.8773 6.6673 6.7354 1.0691 1.0362 1.0634 1.0899 1.0987 1.1006 1.0992 1.0899 1.0921 1.0950 1.0654 1.0660
irintensity: 0.0546 0.0674 0.0357 1.5042 0.9893 0.0822 4.7245 7.7574 76.4635 12.8330 169.3077 18.6063 15.2256 13.9552 8.9794 0.5480 6.6909 4.5505 2.4083 3.7037 11.1457 16.7557 57.5369 2.2354 4.6023 0.0371 54.6947 6.1308 4.5566 14.2783 102.4799 197.1548 87.2044 13.1516 9.0884 42.7082 24.1106 1.6322 3.9570 4.6703 0.8417 12.2163 16.4020 10.4529 2.4697 13.8637 8.2694 37.5984 98.2532 59.7680 101.2072 41.7987 46.8229 18.7987 11.1288 10.6290 70.3839 43.1721 15.4772 5.4604 5.6339 30.6853 34.0922
temp: 298.150 k
press: 1.00000 atm
elementType: 8 8 6 6 6 6 6 6 6 6 6 1 1 1 1 1 1 1 1 1 1 1 1
symmnumber: 1
zpe: 495948.7 jmol-1
zpe.correction: 0.188897 hartree
zpe.thermalcorrener: 0.200186 hartree
zpe.thermalcorrenthalpy: 0.201130 hartree
zpe.thermalcorrgfe: 0.151945 hartree
zpe.sumelectzpe: -499.765801 hartree
zpe.sumelectthermal: -499.754512 hartree
zpe.sumelectthermalent: -499.753567 hartree
zpe.sumelectthermalfe: -499.802752 hartree
dipole: 2.0079 0.3653 -0.1668
dipole: 2.0477
quadrupole: -60.3139 -64.6938 -69.0730
quadrupole: -5.9403 -2.2405 0.9801
quadrupole: 4.3796 -0.0002 -4.3794 -5.9403 -2.2405 0.9801
hfenergy: -499.9546975 hartree
pointgroup: C01 [X(C9H12O2)]
dipole: 0.7895984 -0.151981 0.0496318 debye
dipolederiv: -0.5328391 0.491945 0.0677108 0.5374715 -0.9687681 0.0254331 0.1129267 0.0177595 -0.3829073 -1.5112959 -0.0668958 -0.1820487 -0.0869502 -0.0891704 0.0436727 -0.2182927 0.0442573 -0.4571945 0.0221639 0.0059668 0.0401675 0.0125339 0.1435623 -0.0466394 0.1345172 -0.0275007 0.1233674 0.0226638 -0.0434639 0.0053354 0.2446574 -0.3948796 0.0002456 0.0836533 -0.0570347 -0.1552302 0.0285941 0.0003819 -0.0166849 0.0130929 0.1355537 0.0183043 -0.1186397 -0.0107933 0.0651976 0.5556755 -0.3390833 0.032022 -0.5393113 0.903535 0.0249056 -0.0167949 0.0603802 0.0993133 0.2673759 -0.1072408 0.0604622 -0.1141199 0.1605521 0.0386587 0.0588128 0.0280597 -0.1159207 -0.1004325 -0.0081452 0.00884 -0.0035592 0.1068691 -0.0046159 0.0860659 0.0037792 0.060764 -0.4825766 0.1517909 -0.0147671 0.209008 -0.1317005 0.0538103 -0.0145172 0.0545851 -0.2288593 -0.433761 -0.004817 -0.0245576 -0.3037484 -0.0818596 -0.0239196 -0.0978367 0.0224621 -0.2153428 1.4360237 0.0385384 0.2406274 0.1756939 0.2553051 0.053262 0.2848812 0.0401429 0.1402695 0.0373354 -0.0172601 -0.0118926 -0.0821531 -0.07418 -0.1235308 -0.0141953 -0.0608627 0.0111579 -0.0370844 0.0406964 -0.0445976 0.0850968 -0.0870978 0.1518485 -0.0302389 0.0822563 -0.0217021 0.0254531 -0.0684634 -0.035505 -0.0567964 -0.0846083 -0.1263505 -0.0421242 -0.0731309 -0.0022361 0.0227295 0.0681898 -0.0336743 0.0409505 -0.0543557 0.1208507 -0.0257956 0.0791178 -0.0123716 0.0440096 -0.0984437 -0.0431817 -0.0757844 -0.051727 -0.0452925 -0.0359157 -0.0516585 0.123267 0.0483742 -0.0181902 -0.0217883 -0.0814894 -0.0878294 -0.1149144 -0.077985 -0.1169204 0.0208879 0.0473144 0.0204227 -0.0265988 0.0802427 -0.0855561 0.1237681 -0.0800028 0.1189135 0.0061615 -0.0748648 -0.0028731 0.1094941 0.0034728 0.1015441 -0.0036221 0.1570212 -0.0006643 -0.0930459 0.0200088 -0.0731988 -0.0402408 -0.0735704 -0.0140671 -0.0457226 -0.0447824 -0.0492177 0.1722738 0.033484 0.0796308 -0.0111107 0.0847032 -0.0078486 -0.0192165 -0.0154297 -0.0199303 0.176615 0.1558364 -0.0797469 -0.0630467 -0.0636615 0.3506317 -0.0423945 -0.0879843 -0.0336625 0.3110611 0.4058118 0.0302596 0.0050353 -0.0057794 0.056095 -0.0585408 0.0026567 -0.0503376 0.3744746 unknown
polarizability: 144.7621452|-2.6760908|104.2056399|8.213576|7.2324987|62.124153 unknown
InChI: InChI=1S/C9H12O2/c1-2-3-7-4-5-8(10)6-9(7)11/h4-6,10-11H,2-3H2,1H3
charge 0 multiplicity 1
23 atoms
O  0.471745 -2.191019 -0.026039
O  -3.744607 0.192484 -0.415645
C  1.934693 0.304795 0.643338
C  0.435256 0.255211 0.389971
C  2.785415 0.269796 -0.660328
C  -0.218121 -0.964247 0.055485
C  -0.368018 1.421854 0.442042
C  4.302323 0.292146 -0.378511
C  -1.601774 -1.020091 -0.215519
C  -1.751105 1.400351 0.173464
C  -2.361918 0.168533 -0.156572
H  2.180092 1.231131 1.19607
H  2.261312 -0.525545 1.310002
H  2.527118 -0.627209 -1.259006
H  2.504458 1.13926 -1.28482
H  0.108006 2.375175 0.701948
H  4.588565 1.200606 0.184188
H  4.614206 -0.584208 0.221488
H  4.884264 0.28092 -1.317819
H  -2.052134 -1.988151 -0.463784
H  -2.361685 2.305913 0.217271
H  1.424415 -2.069024 0.210668
H  -4.076806 -0.713482 -0.633291
