program: Gaussian 09
title: 000087847
version: EM64L-G09RevD.01
frameworkgroup: C1[X(C9H12N2O3)]
method: RPBEPBE
basis: SDD
operation: Freq
keyword: #p
keyword: freq=noraman
keyword: PBEPBE/SDD
title: #p freq=noraman PBEPBE/SDD
converged: YES YES NO NO
title: Mulliken charges:
elementType: O O O N N C C C C C C C C C H H H H H H H H H H H H
charge: -0.295947 -0.265154 -0.289708 -0.374996 -0.514859 0.473992 -0.431455 -0.346976 -0.397586 0.326814 -0.352021 -0.351214 0.295719 -0.538254 0.230282 0.231331 0.236795 0.231121 0.251597 0.241245 0.222528 0.221787 0.246614 0.340860 0.303617 0.303867
chargesum: 0.00000
title: Mulliken charges with hydrogens summed into heavy atoms:
elementType: O O O N N C C C C C C C C C
charge: -0.295947 -0.265154 -0.289708 -0.034135 0.092625 0.473992 0.030158 -0.110181 -0.166465 0.326814 -0.100425 -0.109969 0.295719 0.152676
polarizability: 1.92335698e+02 -5.38600920e+00 1.02827102e+02 -1.22771766e+01 -5.93206270e+00 8.45755883e+01
1716.lowfreq: -8.5659 -5.0390 -1.6865 -0.0008 -0.0008 0.0006 9.6598 23.9702 44.0378
frequency: -2.9799 23.8866 43.9939 97.0603 99.8985 148.9346 163.9847 185.8022 214.6698 224.7048 238.3787 269.9337 323.5409 346.3133 414.2026 432.3560 470.9306 516.0941 542.9608 583.2322 632.0109 672.9627 712.4599 714.1898 735.1209 760.0501 812.7135 825.5327 845.6611 886.1735 943.3145 954.9311 964.0075 965.8253 988.0692 1003.8821 1112.8933 1115.4505 1142.3843 1157.3355 1179.7358 1191.4015 1226.3798 1238.1662 1251.0024 1285.2009 1305.5473 1349.6966 1386.7084 1419.7137 1437.2269 1448.1215 1467.7993 1473.4034 1475.4016 1507.2226 1586.1561 1626.1552 1651.3314 1682.9026 2960.6122 3011.6787 3048.8228 3074.9267 3126.6448 3128.2394 3133.4092 3165.2621 3169.8064 3411.8471 3531.3859 3573.7224
redmass: 4.8867 4.5306 5.0454 4.0042 4.4394 4.9677 5.2620 4.0188 2.3739 1.1417 1.3677 4.0241 2.5225 5.0258 2.9375 4.6326 4.9998 4.2216 2.9860 1.1781 6.7317 5.9774 5.9312 3.4188 1.6630 4.7412 1.5927 1.7147 3.0271 5.2333 1.4462 1.6323 3.8087 1.7114 8.2524 2.6359 1.2600 1.3106 4.5309 1.3333 1.2458 1.0850 2.0618 4.2718 2.6187 1.1564 1.2900 1.3747 5.1687 3.5479 1.1702 1.7074 1.0500 1.0705 1.0990 2.6441 7.0820 6.4622 6.7004 1.1184 1.0330 1.0578 1.1040 1.1079 1.0963 1.0926 1.0895 1.0940 1.0958 1.0423 1.1006 1.0790
irintensity: 0.2400 1.2316 0.2178 3.3219 4.1096 3.3586 0.2388 4.7020 2.4892 19.8270 2.6925 23.4051 1.6603 11.7026 0.2968 4.7826 2.5947 24.9849 20.5611 204.3603 0.2013 21.9859 0.1023 7.5171 131.8705 19.0848 49.3251 24.4928 66.2313 23.7885 0.5452 6.3246 185.9361 50.6862 33.7370 2.0895 0.2498 12.3015 451.4464 0.1494 30.3081 2.4605 48.2528 170.1471 91.0637 0.0659 0.7867 39.8906 10.4974 4.8501 5.9499 212.9593 13.8694 42.7185 9.3819 85.5558 11.8351 86.2418 311.6379 1.5908 66.0328 23.2327 48.4881 14.3225 35.4026 2.5037 12.2013 15.5030 3.6818 0.3407 2.0006 40.4913
temp: 298.150 k
press: 1.00000 atm
elementType: 8 8 8 7 7 6 6 6 6 6 6 6 6 6 1 1 1 1 1 1 1 1 1 1 1 1
symmnumber: 1
zpe: 537191.9 jmol-1
zpe.correction: 0.204606 hartree
zpe.thermalcorrener: 0.218126 hartree
zpe.thermalcorrenthalpy: 0.219070 hartree
zpe.thermalcorrgfe: 0.163181 hartree
zpe.sumelectzpe: -684.240869 hartree
zpe.sumelectthermal: -684.227348 hartree
zpe.sumelectthermalent: -684.226404 hartree
zpe.sumelectthermalfe: -684.282293 hartree
dipole: 2.2494 -1.5627 -0.5900
dipole: 2.8018
quadrupole: -70.6002 -74.4625 -87.7439
quadrupole: -8.4902 3.2446 -1.3555
quadrupole: 7.0020 3.1397 -10.1417 -8.4902 3.2446 -1.3555
hfenergy: -684.4454742 hartree
pointgroup: C01 [X(C9H12N2O3)]
dipole: 0.8826014 -0.6511076 0.1101331 debye
dipolederiv: -2.2192074 -0.1756366 -0.2005056 -0.2747337 -0.3614827 -0.1172696 -0.2855035 -0.1130206 -0.4275743 -1.7598995 0.3888067 0.0775015 0.3322481 -0.4064694 -0.0052433 0.2133236 -0.0407557 -0.3217062 -0.9048537 0.1078099 0.1677742 0.0979998 -0.5513037 -0.2875606 0.1731132 -0.2921046 -0.7742536 -0.3813019 -0.124422 -0.1915318 -0.361831 -0.5708144 -0.0968399 -0.5263325 -0.1035643 -0.6219821 -0.0894681 -0.0284819 -0.0399064 -0.1325411 -0.1907862 -0.2390331 -0.189304 -0.2422589 -0.3666229 -0.2215105 0.0293017 -0.0155848 0.0805624 -0.150453 0.0271432 0.1423525 0.0048648 -0.1526278 1.2721085 0.0691218 0.0971553 0.365291 0.3796122 0.079073 0.4448114 0.0916827 0.4146733 0.1745159 -0.0306602 -0.0627878 0.0117247 0.0135036 -0.1152959 -0.0904809 -0.1327888 0.0033154 0.1733786 -0.088105 -0.0072897 -0.0891012 0.0354378 -0.1382433 -0.039765 -0.0987085 -0.0145087 1.5558762 -0.281312 -0.1948328 -0.101131 0.1034824 0.0371757 -0.4212878 0.102277 0.1411145 -0.4258409 0.0539445 0.009533 0.2529047 -0.1028908 -0.1336099 -0.1549166 -0.0848441 -0.0568426 -0.4066728 0.0301978 0.0112644 -0.2393806 -0.0844547 -0.0420834 0.275558 -0.1221256 -0.1674135 2.2629265 0.1509241 0.1573175 0.1209173 0.7424236 0.6067681 0.0831681 0.6070312 1.1829568 0.6337516 -0.1579736 0.0560766 -0.432443 0.4529891 0.0112424 0.2811067 -0.0597277 0.295242 -0.0214023 -0.0153702 0.0066844 -0.0961707 0.028973 0.0793797 -0.0578873 0.0161541 -0.0961494 -0.0479856 0.0348186 -0.0037306 -0.0260636 -0.1058936 -0.0342157 -0.1206938 0.0265603 0.0484087 0.0362273 0.1020815 -0.0393366 0.0963383 0.0179302 0.0839073 -0.0358027 0.076186 0.0816843 0.0485622 -0.0431861 0.086008 -0.0431857 0.0497668 0.0944742 0.0842225 0.0991932 0.0278562 0.0558521 -0.0369577 0.0680648 -0.0331424 0.0774782 0.092479 0.0730384 0.09436 0.0636331 0.0188011 0.0907241 -0.0359097 0.1064625 0.0357172 0.0875988 -0.0388133 0.0900044 0.0989641 0.0292642 -0.1061437 -0.0340796 0.0651064 -0.1684744 -0.0370682 -0.0939424 -0.0059441 0.0601391 0.0591578 0.0190497 0.0198204 0.093034 0.0238141 -0.0385736 -0.143413 0.0070492 -0.1656975 -0.1360221 0.0220123 0.0675323 -0.009962 0.1014574 0.0245966 0.1014584 0.012572 0.0777867 0.0881632 -0.0132011 -0.0040676 0.0259296 0.3105278 -0.0751377 0.0479936 -0.07584 0.2524369 0.1019903 0.0035776 -0.0021188 0.1032052 0.2697147 0.0804956 0.1292975 0.1432336 0.0988565 0.1035895 -0.00092 0.0069492 0.0879619 0.0501947 0.0558407 0.1486988 0.0005145 0.3183109 unknown
polarizability: 192.8168976|-9.9658597|93.9796499|-4.972114|-11.2365883|92.9418401 unknown
InChI: InChI=1S/C9H12N2O3/c1-13-8-4-2-7(3-5-8)6-14-9(12)11-10/h2-5,11H,6,10H2,1H3
charge 0 multiplicity 1
26 atoms
O  -1.966746 -0.181205 -0.239423
O  4.383975 -0.046439 -0.609652
O  -3.933478 0.52506 0.873453
N  -3.989132 -0.815622 -1.059352
N  -5.394198 -0.923129 -1.147005
C  0.298042 0.382406 0.444079
C  -1.155848 0.564416 0.787118
C  0.926021 1.213044 -0.523348
C  1.072914 -0.618588 1.074382
C  3.042084 0.034573 -0.211355
C  2.281084 1.04571 -0.85332
C  2.437931 -0.802771 0.759484
C  -3.356679 -0.098807 -0.054824
C  5.21802 -1.074296 0.0185
H  -1.409113 0.155603 1.781205
H  -1.470859 1.622762 0.755601
H  0.342632 1.99524 -1.023243
H  0.605299 -1.268995 1.823506
H  2.774163 1.679858 -1.596062
H  3.009638 -1.584515 1.267769
H  4.828789 -2.090244 -0.188033
H  5.291694 -0.919972 1.112657
H  6.210753 -0.957494 -0.439939
H  -3.436532 -1.290913 -1.77237
H  -5.788986 -1.404475 -0.328812
H  -5.835566 -0.006306 -1.293913
