program: Gaussian 09
title: 000087871
version: EM64L-G09RevD.01
frameworkgroup: C1[X(C10H5Br5O2)]
method: RPBEPBE
basis: SDD
operation: Freq
keyword: #p
keyword: freq=noraman
keyword: PBEPBE/SDD
title: #p freq=noraman PBEPBE/SDD
converged: YES YES NO YES
title: Mulliken charges:
elementType: Br Br Br Br Br O O C C C C C C C C C C H H H H H
charge: 0.116163 0.116171 0.133191 0.133198 0.136414 -0.301229 -0.182182 0.685505 -0.355177 -0.355246 -0.144832 -0.144826 -0.196481 0.179257 0.332359 -0.759675 -0.595052 0.248538 0.248528 0.221961 0.226096 0.257319
chargesum: 0.00000
title: Mulliken charges with hydrogens summed into heavy atoms:
elementType: Br Br Br Br Br O O C C C C C C C C C C
charge: 0.116163 0.116171 0.133191 0.133198 0.136414 -0.301229 -0.182182 0.685505 -0.355177 -0.355246 -0.144832 -0.144826 -0.196481 0.179257 0.332359 -0.040648 -0.111638
polarizability: 2.67398540e+02 1.40366056e-04 2.37051055e+02 -1.55348865e+01 -7.81819771e-03 1.12910054e+02
1716.lowfreq: -3.4801 0.0002 0.0004 0.0005 3.4827 3.9709 20.5987 29.0182 36.9688
frequency: 20.5546 29.0158 36.9181 37.7450 44.9310 61.9230 86.6448 126.0496 136.0928 138.0696 143.4002 149.0988 171.9311 183.2596 200.0081 213.0175 225.9376 272.7380 291.8213 305.5804 351.4902 369.8829 407.9014 479.8389 526.0690 554.6882 578.4211 601.2484 612.1727 614.3739 672.6927 718.7170 763.7594 775.4204 790.5876 876.6880 937.8699 994.0432 994.1472 1025.7462 1044.2721 1056.0691 1178.5131 1285.7908 1290.8482 1311.1057 1330.4335 1399.5917 1420.1426 1454.0394 1470.2094 1498.0576 1507.6476 1636.2004 1665.6048 2991.4805 3073.0467 3107.4914 3111.5769 3225.0560
redmass: 5.7533 10.1289 4.6719 15.2875 35.8700 5.6401 10.3834 24.7282 52.8497 50.4641 1.0450 74.2921 7.5712 9.5539 63.6056 46.3762 58.2742 10.9216 4.2837 12.1874 9.2946 4.2247 3.5753 5.7925 13.6718 7.0119 12.0109 4.5498 1.9317 7.6306 10.8044 9.8480 12.2369 2.0780 11.5046 8.8536 2.7410 1.5593 1.3116 8.1648 2.6852 1.5061 11.9707 12.0225 4.4647 12.0019 8.6263 1.2069 1.2210 1.0439 1.0618 12.0011 11.5845 6.5898 7.8031 1.0366 1.0973 1.1006 1.0630 1.1148
irintensity: 0.0016 0.3365 1.3233 0.0550 0.1233 1.3256 1.2186 0.1852 0.5312 0.1516 0.6076 0.0007 0.2351 0.9035 0.0125 0.0407 0.0307 0.6553 13.8470 0.0000 1.5936 0.5999 5.1812 3.1097 28.6871 0.3800 0.0340 6.7186 24.3552 0.9010 26.6932 22.3829 0.3690 7.1211 31.8245 3.6503 84.2829 151.8366 42.4437 127.0881 346.7930 5.2244 3.1733 161.3193 228.5336 10.3671 140.5973 20.1644 20.2811 15.7733 26.1190 1.1766 3.1639 94.0583 103.9029 14.1376 10.5860 16.8098 7.5235 9.1692
temp: 298.150 k
press: 1.00000 atm
elementType: 35 35 35 35 35 8 8 6 6 6 6 6 6 6 6 6 6 1 1 1 1 1
symmnumber: 1
zpe: 314484.3 jmol-1
zpe.correction: 0.119781 hartree
zpe.thermalcorrener: 0.139098 hartree
zpe.thermalcorrenthalpy: 0.140042 hartree
zpe.thermalcorrgfe: 0.065921 hartree
zpe.sumelectzpe: -600.535246 hartree
zpe.sumelectthermal: -600.515929 hartree
zpe.sumelectthermalent: -600.514985 hartree
zpe.sumelectthermalfe: -600.589106 hartree
dipole: 2.5866 0.0003 -1.3283
dipole: 2.9078
quadrupole: -118.3365 -139.4656 -148.1583
quadrupole: 0.0021 -3.6739 0.0010
quadrupole: 16.9836 -4.1455 -12.8382 0.0021 -3.6739 0.0010
hfenergy: -600.6550271 hartree
pointgroup: C01 [X(C10H5Br5O2)]
dipole: 1.0039946 0.0002098 0.5484025 debye
dipolederiv: -0.1538434 -0.3260649 -0.0380913 -0.2987546 -0.3832819 -0.0464774 -0.0294308 -0.0461558 0.0438547 -0.1536282 0.3259834 -0.0383793 0.2986654 -0.3833808 0.0468922 -0.0296688 0.0465229 0.0437662 -0.0954211 -0.2838515 -0.0104746 -0.3079929 -0.4456276 -0.0323101 -0.019203 -0.0341695 0.052076 -0.0951701 0.2836738 -0.0107818 0.3078249 -0.445778 0.032879 -0.0195367 0.0347457 0.0520036 -0.611417 0.000083 -0.0813257 0.0000902 0.0771743 -0.0000046 -0.0903402 0.0000129 0.0440931 -2.1828723 0.0002099 0.3021856 0.0001143 -0.2713682 -0.0000463 0.6003256 -0.0000831 -0.5211544 -0.6471962 -0.0000461 -0.2211652 0.0000456 -0.251567 -0.0001343 0.3096135 -0.0002287 -0.8887013 1.150875 -0.0001792 -0.0949718 -0.0001194 -0.1350983 0.0001553 0.2391207 0.0000961 0.0901041 0.0787903 0.4947536 0.0919373 0.6812493 0.5081155 0.1052673 0.015737 0.0595921 -0.0808481 0.0783468 -0.494579 0.0923786 -0.6811498 0.5083658 -0.1057746 0.0164203 -0.0600418 -0.0807196 -0.0881685 0.5275548 -0.0139791 0.6271141 0.6382298 0.0808203 -0.0062298 0.0680141 -0.0420126 -0.0886708 -0.5272251 -0.0134258 -0.6268084 0.6385036 -0.0816444 -0.0056011 -0.0688654 -0.0418526 0.9177274 -0.0001973 0.1351298 -0.000175 -0.4161121 0.0001753 0.1417013 0.0001652 -0.059539 2.124011 -0.0000734 0.1732766 -0.0000379 0.2340656 0.0002215 -0.9993043 0.0004087 1.3003051 -0.2377136 -0.0000902 -0.3702648 -0.0001368 -0.0628471 0.0000228 -0.4196128 0.0000303 0.0233471 -0.0556882 0.0000334 0.0829568 0.000001 0.0620284 -0.0000578 0.0449942 -0.0000408 -0.1257517 0.0340705 0.0000238 0.0149766 0.0000793 -0.2504691 0.000052 0.2258947 0.0000542 -0.0631635 0.1060841 0.0526323 0.0063395 0.0045931 -0.0221613 0.1002144 0.0192073 0.0784601 0.0323599 0.1060819 -0.0526054 0.0064069 -0.004551 -0.0222976 -0.1001805 0.0192406 -0.0784311 0.0324603 -0.1343462 -0.000027 -0.0248302 -0.0000549 0.1103928 -0.0000206 -0.1105394 -0.0000337 0.0456587 -0.1146912 -0.0000194 -0.055741 -0.0000056 0.1503921 -0.0000177 -0.0242274 -0.0000129 0.0974153 0.06284 0.0000105 0.0678429 0.0000092 0.1627211 -0.0000316 0.121439 -0.0000397 0.0462986 unknown
polarizability: 266.5057058|0.0114307|237.0510074|19.4542546|-0.0771374|113.802936 unknown
InChI: InChI=1S/C10H5Br5O2/c1-3(2)10(16)17-9-7(14)5(12)4(11)6(13)8(9)15/h1H2,2H3
charge 0 multiplicity 1
22 atoms
Br 0.349872 2.860886 0.40544
Br 0.348858 -2.8609 0.408314
Br -3.031827 -2.922876 -0.064348
Br -3.030611 2.923632 -0.067658
Br -4.712846 0.000586 -0.305004
O  1.392853 -0.000267 0.628605
O  1.896654 -0.000611 -1.666824
C  0.013684 -0.000011 0.354237
C  -0.682674 1.227982 0.25658
C  -0.683172 -1.227813 0.257943
C  -2.086892 -1.233098 0.06266
C  -2.086384 1.233608 0.061267
C  -2.789871 0.000345 -0.036898
C  2.306015 -0.000447 -0.4918
C  3.728611 -0.000317 -0.050996
C  4.737494 -0.000588 -1.181023
C  4.05627 0.00005 1.271694
H  4.602991 0.884283 -1.829014
H  4.603176 -0.885923 -1.828422
H  5.767006 -0.000355 -0.787512
H  5.105099 0.000188 1.589239
H  3.288093 0.000248 2.050019
