program: Gaussian 09
title: 000087836
version: EM64L-G09RevD.01
frameworkgroup: C1[X(C11H15Br)]
method: RPBEPBE
basis: SDD
operation: Freq
keyword: #p
keyword: freq=noraman
keyword: PBEPBE/SDD
title: #p freq=noraman PBEPBE/SDD
converged: YES YES NO NO
title: Mulliken charges:
elementType: Br C C C C C C C C C C C H H H H H H H H H H H H H H H
charge: -0.063957 0.134613 0.494665 -0.697158 -0.695189 -0.746558 -0.389876 -0.411263 0.523062 -0.386570 -0.372939 -0.852177 0.210096 0.215055 0.223198 0.215965 0.209411 0.225738 0.218438 0.216209 0.218178 0.229621 0.250431 0.232317 0.231504 0.283606 0.283580
chargesum: 0.00000
title: Mulliken charges with hydrogens summed into heavy atoms:
elementType: Br C C C C C C C C C C C
charge: -0.063957 0.134613 0.494665 -0.048809 -0.044076 -0.093734 -0.160255 -0.160831 0.523062 -0.154253 -0.141435 -0.284991
polarizability: 2.01958848e+02 -3.24976019e-01 1.15891203e+02 -3.07553132e+00 2.14760389e-01 9.87152297e+01
1716.lowfreq: -13.0247 -4.6973 -0.0004 -0.0002 0.0005 8.6671 31.6387 44.2774 63.9653
frequency: 31.4434 44.2206 63.8423 112.6855 186.9993 192.8103 230.2583 248.1600 287.8170 303.7173 320.9159 342.9827 348.7526 394.5199 405.8633 457.0443 498.1724 512.8615 587.3824 636.5172 651.4017 754.9448 806.3916 838.1364 844.1904 850.6034 872.1483 918.1493 931.0599 942.1180 963.2902 975.2591 1009.4240 1020.5174 1023.3506 1087.4654 1109.3194 1137.7799 1196.5341 1203.2249 1205.9543 1216.2065 1241.0980 1273.2301 1313.9113 1374.1405 1375.1077 1376.9793 1405.0884 1411.3450 1458.6212 1459.0352 1463.9431 1466.5852 1478.8008 1487.2113 1494.8286 1507.4086 1575.1325 1618.9491 2973.4281 2974.7469 2979.4491 3066.6683 3069.1645 3070.3748 3071.0822 3078.1429 3079.6746 3082.5122 3118.6718 3124.4604 3142.7088 3151.3220 3167.0280
redmass: 3.6530 5.6427 3.7706 4.9229 1.3225 2.1653 2.7618 1.0842 2.6967 1.0503 2.8594 2.7015 2.4547 3.2447 2.8120 2.8540 2.9800 4.4165 2.5952 6.7634 4.1425 3.6272 3.6642 2.6891 1.3383 1.7051 1.4675 1.7475 1.6423 1.2046 1.3597 1.3842 2.7403 1.4901 1.3890 1.1978 2.5067 1.2348 1.1703 2.9594 1.1243 2.5432 2.6954 3.2708 1.3291 4.0635 1.2484 1.2392 1.2026 3.0727 1.1323 1.0512 1.0482 1.0658 1.0727 1.0505 1.1261 2.1507 6.5846 6.2748 1.0350 1.0346 1.0358 1.0575 1.1001 1.0999 1.1003 1.0987 1.0993 1.0993 1.0871 1.0897 1.0961 1.1112 1.0933
irintensity: 0.4848 0.5547 0.1268 1.3383 0.6941 0.8080 2.5913 0.1942 1.8952 0.1059 0.6162 6.0043 2.5927 11.8511 0.3367 0.3378 12.1126 32.2238 73.2087 0.0850 9.2278 0.2791 3.9147 13.8315 3.8031 37.0175 1.9829 3.5144 2.4164 0.2174 0.0069 0.0636 3.7715 4.2225 0.2712 6.6064 32.6970 4.7885 31.4181 6.5476 32.4280 2.0041 50.5245 23.4303 0.0839 2.2185 17.8949 21.1873 8.1445 11.4291 5.4373 0.1329 0.5922 0.6562 15.5530 12.2034 12.5116 18.8483 0.6578 37.4437 30.8495 32.6303 30.5588 18.2344 1.4594 11.7463 14.6470 101.8241 53.5567 44.7304 9.5004 14.8641 21.2354 4.4841 10.7992
temp: 298.150 k
press: 1.00000 atm
elementType: 35 6 6 6 6 6 6 6 6 6 6 6 1 1 1 1 1 1 1 1 1 1 1 1 1 1 1
symmnumber: 1
zpe: 596310.2 jmol-1
zpe.correction: 0.227123 hartree
zpe.thermalcorrener: 0.240109 hartree
zpe.thermalcorrenthalpy: 0.241054 hartree
zpe.thermalcorrgfe: 0.186226 hartree
zpe.sumelectzpe: -440.727353 hartree
zpe.sumelectthermal: -440.714366 hartree
zpe.sumelectthermalent: -440.713422 hartree
zpe.sumelectthermalfe: -440.768250 hartree
dipole: 3.1388 0.0800 -1.5248
dipole: 3.4905
quadrupole: -86.0630 -77.7131 -83.7401
quadrupole: -0.3152 6.2993 0.2151
quadrupole: -3.5576 4.7923 -1.2347 -0.3152 6.2993 0.2151
hfenergy: -440.9544757 hartree
pointgroup: C01 [X(C11H15Br1)]
dipole: -1.1580515 0.0152654 0.7379399 debye
polarizability: 199.9171172|-0.0434698|115.8785933|-14.702882|0.5016289|100.7695694 unknown
InChI: InChI=1S/C11H15Br/c1-11(2,3)10-6-4-9(8-12)5-7-10/h4-7H,8H2,1-3H3
charge 0 multiplicity 1
27 atoms
Br 4.503492 -0.043962 -1.203138
C  -2.399293 0.010616 -0.135889
C  -0.864941 0.036491 0.056557
C  -3.05685 -0.748644 1.056712
C  -2.735835 -0.73042 -1.465965
C  -3.011525 1.43329 -0.202692
C  -0.142328 -1.187018 0.145923
C  -0.120546 1.241388 0.147255
C  1.991282 0.004674 0.404324
C  1.25403 -1.206408 0.315456
C  1.280449 1.227586 0.317211
C  3.470598 -0.011009 0.603696
H  -4.154514 -0.784842 0.924477
H  -2.690942 -1.788052 1.132617
H  -2.839513 -0.241744 2.014704
H  -2.35641 -1.767883 -1.463412
H  -3.831542 -0.769878 -1.612514
H  -2.287965 -0.20876 -2.331294
H  -4.105803 1.358048 -0.338665
H  -2.829663 2.003875 0.727002
H  -2.608897 2.013546 -1.053396
H  -0.67896 -2.140558 0.082902
H  -0.631892 2.206119 0.0856
H  1.784018 -2.165202 0.371059
H  1.829884 2.175442 0.374121
H  3.841097 -0.916813 1.104147
H  3.862468 0.896217 1.084804
