program: Gaussian 09
title: 000087835
version: EM64L-G09RevD.01
frameworkgroup: C1[X(C6H15NO2)]
method: RPBEPBE
basis: SDD
operation: Freq
keyword: #p
keyword: freq=noraman
keyword: PBEPBE/SDD
title: #p freq=noraman PBEPBE/SDD
converged: YES YES NO NO
title: Mulliken charges:
elementType: O O N C C C C C C H H H H H H H H H H H H H H H
charge: -0.295332 -0.295460 -0.157504 0.415185 -0.742871 -0.626131 -0.651229 -0.522000 -0.534491 0.240826 0.221800 0.243797 0.212381 0.274141 0.183398 0.222678 0.195900 0.255484 0.215818 0.227271 0.238984 0.214603 0.228997 0.233757
chargesum: 0.00000
title: Mulliken charges with hydrogens summed into heavy atoms:
elementType: O O N C C C C C C
charge: -0.295332 -0.295460 -0.157504 0.415185 -0.036449 0.043789 0.022833 0.160073 0.142865
polarizability: 8.83665662e+01 3.93161580e-01 8.03817814e+01 4.04535674e-01 -1.06866274e+00 7.22788604e+01
1716.lowfreq: -19.2989 -5.1306 -0.0002 0.0002 0.0009 11.3197 19.8879 83.4716 110.0314
frequency: 9.2913 83.4383 110.0199 145.7867 163.8410 186.3809 195.9389 212.8006 228.3629 242.6744 277.9447 324.6416 363.2758 371.0782 395.7025 468.5899 525.2260 575.9554 664.7428 815.9612 828.0599 964.5249 981.8692 1006.4155 1045.3943 1086.8115 1100.2211 1110.6016 1116.9418 1118.5965 1130.0085 1149.9510 1156.7748 1174.5610 1231.4211 1292.7402 1375.7057 1411.5424 1412.8666 1426.4645 1434.3504 1442.1506 1449.3022 1461.3620 1468.2099 1471.2767 1479.9328 1481.9180 1488.9466 1494.0575 1498.7426 2870.4131 2882.5702 2960.2931 2983.3248 3004.2734 3019.8287 3023.7363 3049.2787 3076.8988 3096.0841 3102.4412 3105.9916 3108.0465 3114.5691 3128.7220
redmass: 1.0520 2.7310 2.6531 1.5572 1.3569 1.5431 1.4831 1.3359 1.2661 1.8751 2.3015 2.9011 2.7487 3.4288 3.1393 3.8553 3.4675 4.2633 4.6051 2.6753 2.5651 2.7599 5.2982 6.8143 1.3916 1.4943 1.5270 1.5816 1.3192 1.5793 1.6882 1.5101 1.8684 1.9634 5.2687 2.8759 1.2391 1.1266 1.1294 1.1272 1.1518 1.0613 1.0533 1.0536 1.0504 1.0534 1.0487 1.0570 1.0494 1.0553 1.0637 1.0565 1.0564 1.0322 1.0292 1.0353 1.0769 1.0785 1.1022 1.1029 1.0978 1.1008 1.0999 1.0995 1.1037 1.0949
irintensity: 0.0264 1.0941 6.1181 2.2450 1.3185 4.8851 3.4782 1.8157 2.8908 7.1120 2.7156 7.9986 0.5125 9.8157 6.6061 8.6875 4.1789 6.3865 7.9965 48.8117 3.2610 71.7432 103.2951 46.0441 10.2779 37.9712 10.3466 32.7870 29.0491 55.0169 104.3094 23.9281 55.8694 38.0559 53.5336 36.0281 42.9177 12.9079 6.2947 6.7041 15.9219 1.6353 1.6918 14.2792 4.7757 24.0772 7.9834 9.1830 16.7675 11.9754 3.9181 67.2350 175.7614 67.5773 53.2573 11.8205 41.7073 60.1880 47.6323 39.2317 14.9732 28.0274 24.1883 15.3033 28.5150 8.6746
temp: 298.150 k
press: 1.00000 atm
elementType: 8 8 7 6 6 6 6 6 6 1 1 1 1 1 1 1 1 1 1 1 1 1 1 1
symmnumber: 1
zpe: 545376.6 jmol-1
zpe.correction: 0.207723 hartree
zpe.thermalcorrener: 0.220143 hartree
zpe.thermalcorrenthalpy: 0.221087 hartree
zpe.thermalcorrgfe: 0.168858 hartree
zpe.sumelectzpe: -442.013843 hartree
zpe.sumelectthermal: -442.001423 hartree
zpe.sumelectthermalent: -442.000479 hartree
zpe.sumelectthermalfe: -442.052707 hartree
dipole: -0.1224 -0.4457 0.3544
dipole: 0.5824
quadrupole: -50.6586 -55.2564 -58.3900
quadrupole: 0.9805 0.7208 -2.8413
quadrupole: 4.1097 -0.4881 -3.6216 0.9805 0.7208 -2.8413
hfenergy: -442.2215658 hartree
pointgroup: C01 [X(C6H15N1O2)]
dipole: -0.0369771 0.1724022 -0.1463578 debye
dipolederiv: -0.6208153 -0.1839234 0.0451641 -0.0981717 -1.0347973 0.1962471 0.0577146 0.1709363 -0.5669965 -1.0495131 0.2925598 0.1149278 0.232358 -0.6748176 0.0095944 0.202768 -0.1382943 -0.4714903 -0.8848054 -0.1083464 -0.0000081 -0.0283192 -0.6479557 0.0378778 -0.0700744 -0.0430248 -0.5822865 1.4536725 0.0767322 -0.0144006 -0.0806864 1.2456341 -0.2332449 -0.1246757 0.1151852 0.7878835 -0.1261983 -0.0010912 -0.0135464 0.0236515 -0.0874015 0.1321177 -0.0028205 0.0965808 -0.2849298 0.1461059 0.1754972 0.0450786 0.2866645 0.4178598 -0.0097561 0.0766248 -0.0024457 0.2861796 0.3384928 -0.075757 -0.1691296 -0.1842083 0.1978159 -0.0663558 -0.2418612 -0.0846854 0.2931418 0.3047012 0.0144838 -0.0234732 0.0177952 0.3943684 -0.085183 -0.0711005 -0.2443537 0.3531715 0.6323234 -0.188286 -0.0095379 -0.0650722 0.3084406 -0.0582298 0.1092241 -0.1134763 0.2299964 -0.1018508 0.004426 -0.116075 0.0028956 0.0926994 0.0119189 -0.1124787 0.006087 0.0592963 0.0789833 -0.0680656 0.0050154 -0.0589841 -0.1199614 0.0178226 0.0025049 -0.0170886 0.0756383 0.0103437 0.0608746 0.1162395 0.0596108 0.0471813 -0.0750416 0.1023685 -0.0524852 0.0291371 -0.1121423 -0.026076 -0.1670406 0.0485036 0.0447981 0.0572418 -0.1355355 0.0187385 -0.0091815 0.089841 0.0899201 0.1113909 0.0535195 0.0302783 -0.055702 0.0920933 -0.0431341 0.0629527 -0.000103 -0.1322452 0.0238496 -0.1336998 -0.1624349 0.04486 0.107432 0.1825967 -0.0961021 -0.1097344 0.0855442 -0.0728851 0.0512498 0.0862258 0.0364075 -0.1438142 0.0621401 -0.0263022 -0.0619036 0.0159084 0.120595 -0.0810835 -0.0317597 0.1487914 0.1979721 0.0536242 -0.1399666 0.1198114 -0.0933669 -0.0352423 -0.0532561 -0.0556651 -0.0700458 0.0086483 -0.0798562 0.0550421 0.0598982 -0.1093521 -0.0109034 -0.0934508 -0.1315123 -0.016721 -0.0367866 -0.0620899 0.0617332 -0.0248074 0.0351203 0.1091531 0.0850539 0.0454556 -0.0728823 0.1125298 0.0259615 -0.064293 -0.0934078 0.0934406 -0.1082148 0.0312097 0.0861147 0.0225586 -0.0560526 0.078788 0.0005165 -0.019278 0.0249025 -0.0049885 0.0502336 -0.0685759 0.1290062 -0.1019503 0.1730957 -0.0483329 -0.0144235 0.0581472 0.0779477 0.0612284 0.082191 -0.0441069 0.1284437 -0.0666546 -0.0634906 -0.0151903 -0.0410471 -0.0239163 -0.1270419 -0.0641816 -0.0571747 -0.101174 -0.0361453 0.0586829 unknown
polarizability: 88.2703081|-0.9588899|80.3742519|-0.5325288|-1.3626239|72.382648 unknown
InChI: InChI=1S/C6H15NO2/c1-6(8-4,9-5)7(2)3/h1-5H3
charge 0 multiplicity 1
24 atoms
O  -0.656881 -1.264239 -0.520477
O  -0.972614 0.841403 0.613847
N  1.184338 0.032716 0.323371
C  -0.132507 0.091633 -0.329473
C  -0.147199 0.713341 -1.74194
C  1.703222 1.28245 0.907945
C  2.202738 -0.733737 -0.417221
C  -0.756031 -2.056786 0.721091
C  -2.361605 1.037306 0.184299
H  -1.150139 0.655126 -2.194905
H  0.166107 1.770319 -1.685946
H  0.548051 0.166549 -2.39974
H  2.539262 1.037728 1.58909
H  0.908947 1.774206 1.485957
H  2.089736 2.000079 0.142501
H  3.009395 -1.029188 0.278677
H  2.67229 -0.159675 -1.25284
H  1.750128 -1.647544 -0.835705
H  -1.174381 -3.025737 0.405595
H  -1.425802 -1.564682 1.449666
H  0.236082 -2.188061 1.187357
H  -2.445965 1.82689 -0.587793
H  -2.902379 1.35738 1.089235
H  -2.797195 0.096321 -0.201891
