program: Gaussian 09
title: 000087829
version: EM64L-G09RevD.01
frameworkgroup: C1[X(C12H10O2)]
method: RPBEPBE
basis: SDD
operation: Freq
keyword: #pfreq=noraman
keyword: PBEPBE/SDD
title: #p freq=noraman PBEPBE/SDD
converged: YES YES NO NO
title: Mulliken charges:
elementType: O O C C C C C C C C C C C C H H H H H H H H H H
charge: -0.440417 -0.431322 0.385225 0.349046 -0.517895 -0.361919 -0.362449 -0.428755 0.298401 -0.400151 -0.363208 -0.197230 0.286085 -0.415020 0.260393 0.237505 0.243019 0.236163 0.219001 0.251072 0.223216 0.221305 0.353830 0.354103
chargesum: 0.00000
title: Mulliken charges with hydrogens summed into heavy atoms:
elementType: O O C C C C C C C C C C C C
charge: -0.086587 -0.077219 0.385225 0.349046 -0.257502 -0.124414 -0.119430 -0.192593 0.298401 -0.181150 -0.112136 0.025987 0.286085 -0.193715
polarizability: 2.33481169e+02 -1.34966152e+00 1.34238802e+02 -2.88260018e+00 -4.07081998e+00 6.09092390e+01
1716.lowfreq: -2.4458 -0.0006 0.0010 0.0010 5.6660 7.5667 56.3933 68.9099 105.2406
frequency: 56.3845 68.9067 105.2387 185.8610 225.7970 269.9791 303.4713 341.4448 355.7816 365.4229 396.1001 412.6167 446.3478 467.9495 515.0200 523.9159 558.0285 602.2207 637.6244 683.5187 693.6139 726.1974 777.9008 801.1957 806.7278 834.3196 866.1977 869.4650 888.0022 933.4813 959.5619 960.1785 983.7680 1001.1856 1036.1573 1092.1784 1106.4839 1144.6799 1148.0081 1178.0313 1187.6255 1215.1091 1251.4199 1296.4197 1303.9476 1313.0292 1376.0281 1385.6453 1427.7352 1463.4204 1473.7385 1517.4753 1581.0621 1594.7934 1624.3910 1629.8806 3113.1980 3116.9105 3137.4077 3139.9490 3147.9067 3158.8627 3163.8527 3172.2684 3580.1986 3583.5737
redmass: 4.2117 5.5660 5.1147 5.5336 4.3790 6.6456 5.4077 5.2842 1.1174 1.1239 3.9063 2.9635 3.3707 3.3828 3.9744 3.9009 7.4427 3.9223 6.7255 6.3879 2.0155 3.4501 1.5830 5.5884 1.3886 1.5121 2.9975 1.8118 1.5747 1.3724 1.3474 1.3531 5.5915 3.1029 2.2886 1.6451 1.4380 1.3792 1.3502 1.0866 1.1206 1.8854 2.4440 1.4939 2.9211 1.3451 3.3378 8.1420 3.8070 2.8232 2.5122 3.0772 5.8245 6.8035 6.2468 6.3958 1.0886 1.0880 1.0904 1.0890 1.0947 1.0953 1.0942 1.0960 1.0660 1.0660
irintensity: 1.0349 1.1489 1.1073 1.4248 0.6039 1.0654 7.6775 8.7023 128.5169 158.8814 6.8913 0.7553 6.8480 4.6663 5.6258 15.3586 18.8788 13.7547 2.0820 4.4497 23.8091 3.5629 75.7004 7.9840 23.5977 52.6929 50.9100 13.0983 14.6808 0.8102 0.3017 0.9265 1.7989 1.6083 23.7162 18.1531 71.7795 319.3407 117.0569 0.6036 20.3793 0.3512 34.5690 45.4084 3.7057 14.0159 36.4347 0.2733 1.2648 32.2143 100.0336 50.2611 56.1104 28.8224 146.1900 10.6218 23.6040 11.1044 16.7177 12.2698 7.0441 22.2336 2.2190 6.1412 54.9213 35.8022
temp: 298.150 k
press: 1.00000 atm
elementType: 8 8 6 6 6 6 6 6 6 6 6 6 6 6 1 1 1 1 1 1 1 1 1 1
symmnumber: 1
zpe: 486191.1 jmol-1
zpe.correction: 0.185180 hartree
zpe.thermalcorrener: 0.196742 hartree
zpe.thermalcorrenthalpy: 0.197686 hartree
zpe.thermalcorrgfe: 0.147512 hartree
zpe.sumelectzpe: -612.743633 hartree
zpe.sumelectthermal: -612.732071 hartree
zpe.sumelectthermalent: -612.731127 hartree
zpe.sumelectthermalfe: -612.781301 hartree
dipole: -0.8728 2.5029 -0.3446
dipole: 2.6730
quadrupole: -58.6553 -76.7102 -86.6552
quadrupole: 6.3450 -3.9744 -2.4060
quadrupole: 15.3516 -2.7033 -12.6483 6.3450 -3.9744 -2.4060
hfenergy: -612.928813 hartree
pointgroup: C01 [X(C12H10O2)]
dipole: -0.3538183 0.980706 -0.1377376 debye
dipolederiv: -0.6918995 -0.5981967 -0.1197961 -0.8192687 -0.8897283 -0.1000464 -0.1676362 -0.101455 -0.447881 -1.7837527 0.1216745 0.0225152 0.1502727 -0.1142311 -0.1186823 0.0223349 -0.1197801 -0.3836746 0.6666457 0.0095354 0.0028531 -0.0854901 0.1805833 0.0642021 -0.0202895 0.029463 0.0266173 0.0123445 -0.0272458 0.0062328 0.0027089 -0.149523 0.0299676 0.0059597 0.0556192 -0.0398334 -0.4937482 -0.2705363 -0.0606664 -0.0887969 -0.0891433 0.0365126 -0.0419095 0.0250345 -0.1686168 0.1201491 0.0857519 -0.0347852 0.0200217 0.0555828 -0.0885444 0.0588609 -0.0876046 -0.0902443 0.1126041 -0.0661945 -0.0019461 -0.0468398 0.0777581 -0.0997285 -0.0722048 -0.0775453 -0.0940207 -0.3928315 0.103069 0.0359651 0.1709055 -0.1284335 0.0318865 0.0598875 0.0271364 -0.1895616 0.7987103 0.5830581 0.1164697 0.7798733 0.832767 0.156318 0.1977946 0.1570816 0.118128 -0.3856899 0.0050429 0.0022149 0.3927645 -0.0408546 -0.0822556 -0.1629416 -0.0674858 -0.1706165 -0.3984907 0.0409401 -0.0033276 -0.3048253 0.0386836 -0.0636226 0.1444487 -0.087183 -0.1441419 0.265976 -0.0573174 -0.0120525 0.0589279 0.1385028 0.0557756 -0.0218545 0.0612462 -0.1065135 1.6305309 -0.0927407 -0.0446701 -0.122926 0.0747179 0.0078501 -0.0414417 0.004809 0.0763759 -0.1685253 0.0580966 0.0128428 -0.2912316 -0.3229662 -0.0290097 -0.0630743 -0.0181298 -0.2362815 0.0931985 0.0701439 0.0165832 0.0675745 -0.0101752 -0.0438657 0.0229535 -0.0338084 0.148747 0.0755307 0.0848676 -0.0310407 0.0799656 -0.0254285 0.0690253 -0.0376731 0.0584749 0.1143049 0.0484243 -0.0939111 0.0466081 -0.0852917 0.0094988 0.0619703 0.0505661 0.0513981 0.1121167 0.028058 -0.1058789 -0.0283179 -0.093383 -0.0107529 -0.0455046 -0.0343102 -0.036928 0.144976 -0.0623657 -0.0950054 0.0500028 -0.1025552 0.0005117 0.0721855 0.0460623 0.0746924 0.1412634 0.0424211 0.0636309 -0.0186712 0.0799909 -0.0043635 0.0641997 -0.0159941 0.0659796 0.1465772 0.0277414 0.0762465 0.015997 0.0980651 -0.0806344 -0.0496116 0.0223257 -0.0518235 0.1419563 -0.1556096 -0.0050032 -0.0010506 -0.0312927 0.0827991 -0.0211579 -0.0001435 -0.0182236 0.1763105 0.1751652 0.1244879 0.0231159 0.2142173 0.2835144 -0.0177884 0.0370554 -0.0181174 0.3792272 0.4354133 -0.0145155 0.0049239 -0.0433869 0.0913153 0.1099246 0.0112239 0.1071495 0.3447854 unknown
polarizability: 233.4914089|-0.3253555|134.1991425|-3.0479844|-4.2949175|60.9386588 unknown
InChI: InChI=1S/C12H10O2/c13-11-6-4-9(5-7-11)10-2-1-3-12(14)8-10/h1-8,13-14H
charge 0 multiplicity 1
24 atoms
O  -3.829967 -1.876653 -0.382491
O  4.877046 -0.366761 -0.030645
C  -0.834021 0.269477 0.048344
C  0.649065 0.122059 0.020477
C  -1.674542 -0.851358 -0.174014
C  1.484569 1.183727 -0.420516
C  1.280771 -1.085163 0.43447
C  -1.439904 1.534588 0.299721
C  -3.077761 -0.710726 -0.143406
C  2.887818 1.053602 -0.449423
C  2.679329 -1.232108 0.411807
C  -2.843016 1.664755 0.323344
C  3.486529 -0.159348 -0.031462
C  -3.678764 0.54699 0.103255
H  -1.258324 -1.836006 -0.407273
H  1.031755 2.115456 -0.776753
H  0.66936 -1.913396 0.808872
H  -0.81208 2.406244 0.511463
H  3.508659 1.886033 -0.805993
H  3.160951 -2.157454 0.740819
H  -3.295045 2.641816 0.526929
H  -4.771059 0.652956 0.124029
H  -4.799189 -1.680583 -0.353789
H  5.35372 0.438855 -0.351164
