program: Gaussian 09
title: 000087838
version: EM64L-G09RevD.01
frameworkgroup: C1[X(C6H13NO3S3)]
method: RPBEPBE
basis: SDD
operation: Freq
keyword: #p
keyword: freq=noraman
keyword: PBEPBE/SDD
title: #p freq=noraman PBEPBE/SDD
converged: YES YES NO NO
title: Mulliken charges:
elementType: S S S O O O N C C C C C C H H H H H H H H H H H H H
charge: 1.029821 0.185521 0.000041 -0.570748 -0.522681 -0.520945 0.001397 -0.302319 -0.547597 -0.660398 -0.436112 -0.614667 -0.622028 0.252622 0.247242 0.307156 0.297003 0.283821 0.293394 0.274370 0.239581 0.241598 0.263735 0.263024 0.238354 0.378815
chargesum: 0.00000
title: Mulliken charges with hydrogens summed into heavy atoms:
elementType: S S S O O O N C C C C C C
charge: 1.029821 0.185521 0.000041 -0.191932 -0.522681 -0.520945 0.001397 0.197545 0.056562 -0.083184 -0.436112 0.140881 0.143085
polarizability: 1.75454027e+02 -1.46088948e+01 1.38308671e+02 -1.84211553e+01 -7.33591942e+00 1.31132540e+02
1716.lowfreq: -8.9112 -5.6599 -0.0034 -0.0026 -0.0012 3.9620 8.9678 23.9577 40.5262
frequency: -6.6371 23.8160 40.3996 46.2978 60.5875 83.8650 85.6009 103.1208 116.8131 164.1934 168.8079 228.5803 236.1618 247.6805 252.4826 288.1470 298.7925 319.0933 335.2762 344.9645 384.0019 420.2255 429.3525 530.0195 534.7026 554.4269 601.4916 628.4236 770.5648 831.0389 843.1519 847.3057 922.6132 943.3844 986.0742 1021.6815 1045.4866 1048.8888 1074.4185 1081.9054 1130.2521 1133.9087 1136.5663 1201.2786 1236.5489 1251.7132 1269.2171 1309.2290 1353.3774 1381.4741 1402.6311 1419.4618 1425.8102 1453.9461 1465.9328 1468.3644 1475.1501 1483.6781 1503.3765 2979.3333 2985.8391 2995.6363 2998.4564 3057.4010 3066.6759 3067.3913 3073.3936 3094.7844 3117.4405 3121.4443 3169.5664 3499.4642
redmass: 9.7866 4.3771 5.9586 2.5551 1.9878 1.8200 1.7462 6.4081 1.9771 4.2564 1.5548 2.8926 3.2068 4.1180 2.8472 2.9772 4.8058 6.7692 7.7739 4.8389 5.0874 3.7889 4.6573 9.0016 4.6056 14.7363 4.3251 4.8839 1.2962 1.9723 6.0346 5.2456 3.1099 4.9478 2.8716 1.7314 1.4047 1.5514 2.5017 1.2313 1.2491 1.3597 1.7987 1.1856 3.4362 1.2332 1.2046 1.1476 1.3037 2.1042 1.1279 1.1052 1.1218 1.1329 1.0420 1.0888 1.0797 1.0453 1.5102 1.0343 1.0356 1.0584 1.0638 1.1024 1.1023 1.1019 1.0566 1.1024 1.0995 1.0991 1.1106 1.0664
irintensity: 0.4016 1.9230 0.9221 2.0409 3.0966 1.0504 1.9294 1.3095 0.1092 5.6586 46.6348 24.4486 34.9057 5.1002 8.8053 18.6982 42.9915 4.9412 9.3880 16.5416 43.4975 6.1620 7.5665 0.7360 3.8724 137.4158 5.4372 14.5489 13.6025 9.2637 5.7145 64.7609 76.1602 93.2789 19.1458 35.3097 53.4254 15.6140 12.9206 0.0672 5.1297 6.5887 108.8344 8.9539 40.9343 7.1026 1.5777 4.3884 8.2590 101.1710 6.3249 26.3210 16.7947 6.9374 24.0998 20.7120 10.2017 8.9197 176.7580 43.7379 43.7838 0.4380 33.7407 5.3706 19.1123 20.9716 3.1964 2.1599 16.7016 2.7752 0.2292 42.9383
temp: 298.150 k
press: 1.00000 atm
elementType: 16 16 16 8 8 8 7 6 6 6 6 6 6 1 1 1 1 1 1 1 1 1 1 1 1 1
symmnumber: 1
zpe: 506454.5 jmol-1
zpe.correction: 0.192898 hartree
zpe.thermalcorrener: 0.209887 hartree
zpe.thermalcorrenthalpy: 0.210831 hartree
zpe.thermalcorrgfe: 0.145910 hartree
zpe.sumelectzpe: -1709.814740 hartree
zpe.sumelectthermal: -1709.797752 hartree
zpe.sumelectthermalent: -1709.796808 hartree
zpe.sumelectthermalfe: -1709.861729 hartree
dipole: -6.1554 -0.0051 1.5089
dipole: 6.3376
quadrupole: -100.1668 -95.4742 -106.7875
quadrupole: 3.3696 -12.1044 6.5440
quadrupole: 0.6427 5.3353 -5.9780 3.3696 -12.1044 6.5440
hfenergy: -1710.0076387 hartree
pointgroup: C01 [X(C6H13N1O3S3)]
dipole: -2.391912 0.4593798 0.5336386 debye
dipolederiv: 1.3606118 -0.0211451 -0.0494231 0.1465817 1.4379286 -0.1168205 -0.1036011 -0.1171999 1.3780046 -0.3414868 0.1529481 -0.2056717 0.2518377 -0.2763766 0.2216936 -0.325659 0.2973229 -0.436408 -0.4913207 0.0904034 0.0935068 0.1352839 -0.3020085 -0.0322651 0.1414881 -0.0340776 -0.8547264 -0.4148127 -0.0225644 0.1410166 -0.1198569 -0.86346 0.2740123 0.1944852 0.2677166 -0.7503934 -0.7651442 0.0520543 0.0296757 0.0477354 -0.5997674 -0.0194478 0.0552405 -0.0793218 -0.4789123 -0.6572656 -0.0486757 -0.0001008 -0.1090637 -0.5127757 -0.1053983 -0.1096065 -0.0668118 -0.6272217 -0.8465915 0.4819958 0.2184411 0.661147 -0.65036 -0.1733268 0.1328922 -0.0452187 -0.5910327 -0.2753681 -0.12874 0.0286701 0.1032305 -0.0061632 0.0354829 -0.0213976 -0.059596 0.0914872 0.3705196 0.1493147 0.0038957 0.2583689 0.0477065 -0.0313161 0.057271 -0.0047232 -0.0419571 0.5383593 -0.0589684 -0.0274319 -0.238403 0.146131 -0.027382 -0.0853807 0.1318783 -0.0788238 0.7870103 -0.7196845 -0.199027 -0.9062548 0.5451056 0.0563732 -0.1170123 -0.1200713 1.2225847 0.2427078 -0.0051264 0.0896158 -0.0622843 0.274309 -0.0506138 0.3302043 -0.2338767 0.0585266 0.1672861 0.046234 -0.0396776 0.0690023 0.1461791 0.0282205 -0.1898429 0.116442 0.3181533 -0.0234027 0.1233815 0.0224423 0.0060902 0.0154121 -0.0192563 0.0566569 -0.0510451 0.0824392 0.1056465 -0.0066454 -0.0231404 -0.0506419 0.0756831 -0.0459458 -0.0414587 0.0047743 -0.0504252 0.0350086 -0.0501934 -0.0386974 -0.0412211 0.063971 -0.0025999 0.0369405 0.0241253 0.0212426 0.0321329 0.0328464 0.0162921 -0.0183908 -0.0058988 -0.0055743 -0.010345 -0.0338237 0.0504072 -0.0524762 -0.0001571 0.0204526 -0.0080281 -0.0681595 0.0608161 0.020438 0.086457 0.0766471 0.0152388 -0.0115538 0.015742 -0.0048095 0.1327666 -0.0144572 0.0574545 -0.1375957 0.0383906 0.1657333 -0.0422568 0.0974617 -0.0436374 0.1604557 -0.0690302 -0.010413 0.0390065 -0.0149252 0.0518016 -0.0086778 -0.0378181 0.0596408 -0.1531785 -0.0282117 -0.0527554 -0.065804 0.0927939 -0.1842049 0.0149885 -0.0205128 -0.0394557 0.0380774 0.0229728 -0.0050685 0.0576077 0.1126812 -0.0199105 -0.0745842 -0.092315 -0.0630551 0.0912502 -0.0080693 -0.0014025 -0.0461498 -0.0139977 0.0983087 -0.0442575 0.0148491 -0.092951 -0.0405267 0.0770125 0.0585218 -0.0015178 0.001053 -0.022057 0.1215929 0.0421469 0.1430735 0.0038047 -0.0370245 -0.0292152 0.0280939 0.0960481 0.1236755 -0.0225288 -0.1003928 -0.0839384 0.2998943 0.0101559 -0.0384345 0.0434086 0.2983643 unknown
polarizability: 173.6349097|-24.638906|129.4850408|-5.7117668|-3.6882474|141.7752884 unknown
InChI: InChI=1S/C6H13NO3S3/c1-7(2)6(11)12-4-3-5-13(8,9)10/h8H,3-5H2,1-2H3
charge 0 multiplicity 1
26 atoms
S  3.265886 0.61679 -0.36657
S  -1.431358 -0.69484 0.948063
S  -1.733546 -0.069058 -2.125997
O  3.122915 1.936607 -1.67713
O  4.327491 -0.513128 -0.835019
O  3.451172 1.3099 1.085175
N  -3.164696 1.08869 -0.089281
C  1.273477 -1.284974 0.187769
C  1.459664 -0.000342 -0.622358
C  -0.172847 -1.815217 0.100793
C  -2.19831 0.208446 -0.502251
C  -3.919172 1.918924 -1.053948
C  -3.530709 1.256278 1.337225
H  1.949208 -2.071497 -0.20119
H  1.543823 -1.108762 1.246174
H  1.38136 -0.124986 -1.711508
H  0.852413 0.848657 -0.274353
H  -0.261383 -2.779256 0.628131
H  -0.515921 -1.921772 -0.944973
H  -3.526051 1.744451 -2.065919
H  -3.807874 2.987513 -0.79451
H  -4.991229 1.648723 -1.028988
H  -2.664464 1.598826 1.93206
H  -3.898854 0.307129 1.767339
H  -4.329128 2.01028 1.408448
H  3.988531 2.436716 -1.702682
