program: Gaussian 09
title: 000087846
version: EM64L-G09RevD.01
frameworkgroup: C1[X(C13H15N2O2)]
method: RPBEPBE
basis: SDD
operation: Freq
keyword: #p
keyword: freq=noraman
keyword: PBEPBE/SDD
title: #p freq=noraman PBEPBE/SDD
converged: YES YES NO NO
title: Mulliken charges:
elementType: O O N N C C C C C C C C C C C C C H H H H H H H H H H H H H H H
charge: -0.315358 -0.285231 -0.128129 -0.132246 0.282319 0.388712 -0.414266 0.378388 -0.355750 -0.271830 -0.182908 -0.394872 -0.164433 -0.614120 0.326582 -0.600076 -0.607661 0.349368 0.267712 0.282765 0.274848 0.284982 0.271839 0.283129 0.250735 0.283166 0.278593 0.248323 0.248941 0.248248 0.269795 0.248439
chargesum: 1.00000
title: Mulliken charges with hydrogens summed into heavy atoms:
elementType: O O N N C C C C C C C C C C C C C
charge: -0.315358 -0.285231 -0.128129 -0.132246 0.282319 0.388712 -0.064899 0.378388 -0.088037 0.010935 0.091940 -0.109891 0.107406 0.202909 0.326582 0.175780 0.158820
polarizability: 2.88876609e+02 1.24764516e+01 1.66918280e+02 2.46570347e-01 1.93523789e-02 7.45455916e+01
1716.lowfreq: -6.1545 0.0001 0.0006 0.0007 6.3993 9.4001 27.6861 40.5797 81.0044
frequency: 27.6343 40.5547 80.8251 95.1044 99.0931 115.1803 134.0597 163.6806 197.5923 204.6676 225.1784 258.2261 273.6633 314.2918 345.3958 375.2074 411.7525 415.3713 467.4522 504.1752 506.5603 513.7787 534.9890 561.4949 611.3532 655.4313 663.8490 701.8465 725.7063 756.2562 776.2260 803.0560 851.4038 851.5075 908.2406 914.9868 947.2601 970.7615 981.0119 998.9432 1015.8464 1055.0914 1073.1041 1094.2316 1096.3182 1120.0158 1128.9371 1148.6449 1155.8066 1164.1738 1185.8999 1227.1838 1252.4752 1255.1061 1296.1485 1349.0858 1363.1366 1390.3270 1418.1923 1428.5318 1439.7764 1441.9756 1463.9741 1467.4373 1470.2965 1472.3648 1473.8794 1486.6788 1494.6845 1496.0951 1522.0183 1575.2052 1588.2128 1635.8247 1708.0599 2993.0931 2996.5442 3019.7892 3071.3945 3079.2269 3117.8776 3141.3014 3146.4537 3158.9884 3161.1855 3167.5050 3187.1627 3189.2259 3206.0555 3208.1319
redmass: 4.3656 4.1176 1.0867 4.3565 3.1681 1.2198 3.3850 3.8264 4.3607 2.0863 1.4465 5.1932 2.8243 4.4616 3.5998 4.7176 3.3241 3.1693 3.5820 3.0587 5.6686 6.0274 3.2602 6.8088 5.8248 3.7659 11.7329 6.6823 7.0809 2.5271 7.2224 1.4441 4.0153 1.5791 4.9414 1.3959 1.3818 4.7534 1.3374 1.4046 2.6732 1.4508 2.2425 1.2217 2.2096 1.3577 1.4824 1.3762 1.5064 1.6715 1.3937 4.5532 2.5606 1.9368 1.7798 2.5158 3.1958 3.8168 1.6468 1.1430 1.8275 1.1859 3.5125 1.6961 1.0523 1.0393 1.0406 1.0421 1.3993 1.1656 3.5109 6.4284 4.8345 6.9464 8.6283 1.0369 1.0367 1.0343 1.1023 1.1026 1.1035 1.0996 1.1029 1.0906 1.0925 1.0965 1.0975 1.0920 1.0927 1.1002
irintensity: 6.6352 0.6881 0.1701 3.5733 2.2531 0.0019 0.4862 1.8741 2.6629 1.0040 2.4527 0.1063 6.0554 1.7048 13.0919 13.2335 3.8172 3.6838 1.1737 8.0616 5.2958 1.5451 0.9372 5.4784 20.7031 7.6324 16.0051 35.2561 11.2523 13.9820 73.0580 6.0191 11.1530 73.8770 18.7121 39.8406 2.3764 178.2611 0.0460 1.2704 1.8185 54.9580 6.4272 2.2546 807.6171 1.1059 3.5389 0.0322 37.3528 22.5460 5.2494 44.7392 28.2908 32.4353 204.8799 74.3802 79.6780 20.6142 8.3921 27.4540 4.4093 8.4428 183.9650 19.7493 19.0142 24.9375 0.0670 45.7226 53.9399 13.6130 90.8002 131.5704 44.2382 200.6143 361.6020 15.4129 73.6142 3.8320 21.0593 16.0074 2.0533 1.0532 3.9685 0.4773 0.6953 3.6899 0.0731 0.1268 34.5804 1.1305
temp: 298.150 k
press: 1.00000 atm
elementType: 8 8 7 7 6 6 6 6 6 6 6 6 6 6 6 6 6 1 1 1 1 1 1 1 1 1 1 1 1 1 1 1
symmnumber: 1
zpe: 680570.1 jmol-1
zpe.correction: 0.259215 hartree
zpe.thermalcorrener: 0.275296 hartree
zpe.thermalcorrenthalpy: 0.276240 hartree
zpe.thermalcorrgfe: 0.214920 hartree
zpe.sumelectzpe: -762.893880 hartree
zpe.sumelectthermal: -762.877799 hartree
zpe.sumelectthermalent: -762.876855 hartree
zpe.sumelectthermalfe: -762.938175 hartree
dipole: 5.0526 -0.0962 0.0492
dipole: 5.0537
quadrupole: -13.9347 -72.3381 -100.3801
quadrupole: 8.7246 -0.0261 0.0427
quadrupole: 48.2829 -10.1205 -38.1624 8.7246 -0.0261 0.0427
hfenergy: -763.153095 hartree
pointgroup: C01 [X(C13H15N2O2)]
dipole: -1.9847709 -0.117011 -0.017795 debye
polarizability: 289.5875864|-5.7868879|155.9526695|-6.5283546|28.7610874|84.800225 unknown
InChI: InChI=1S/C13H15N2O2/c1-14(2)13(16)17-11-7-6-10-5-4-8-15(3)12(10)9-11/h4-9H,1-3H3
charge 1 multiplicity 1
32 atoms
O  2.011496 -0.519083 -0.327645
O  2.21246 1.727138 0.46349
N  -2.556088 1.234214 0.379008
N  4.10252 0.429408 -0.057352
C  -1.642968 0.225273 0.007675
C  -2.178309 -1.048122 -0.430116
C  -0.247269 0.459061 0.063715
C  0.623873 -0.580682 -0.318564
C  -1.249838 -2.076142 -0.806801
C  -3.585287 -1.241145 -0.47511
C  -3.90581 1.023867 0.326134
C  0.118164 -1.85367 -0.754059
C  -4.450775 -0.202015 -0.096555
C  -2.038918 2.556246 0.836693
C  2.770335 0.672907 0.071197
C  5.046705 1.512191 0.301171
C  4.709431 -0.833936 -0.525586
H  0.182558 1.405289 0.388514
H  -1.638594 -3.043989 -1.138899
H  -3.988048 -2.203663 -0.80684
H  -4.541172 1.858493 0.629914
H  0.836069 -2.627318 -1.03832
H  -5.535697 -0.317832 -0.12038
H  -1.444601 3.026628 0.036747
H  -2.886562 3.209447 1.086513
H  -1.408718 2.425732 1.731198
H  4.48467 2.399783 0.623534
H  5.668993 1.770744 -0.574112
H  5.705785 1.17849 1.122573
H  5.319336 -0.640221 -1.426552
H  3.934897 -1.570571 -0.767149
H  5.366957 -1.243923 0.262366
