program: Gaussian 09
title: 000087826
version: EM64L-G09RevD.01
frameworkgroup: C1[X(C10H10ClNOS)]
method: RPBEPBE
basis: SDD
operation: Freq
keyword: #p
keyword: freq=noraman
keyword: PBEPBE/SDD
title: #p freq=noraman PBEPBE/SDD
converged: YES YES NO NO
title: Mulliken charges:
elementType: Cl S O N C C C C C C C C C C H H H H H H H H H H
charge: -0.045068 0.226119 -0.241491 -0.425818 -0.344511 -0.461211 -0.671129 0.446527 -0.381903 0.134746 -0.346264 -0.181978 -0.074459 -0.237550 0.253701 0.213784 0.242580 0.229199 0.266312 0.263852 0.328063 0.279571 0.263769 0.263158
chargesum: 0.00000
title: Mulliken charges with hydrogens summed into heavy atoms:
elementType: Cl S O N C C C C C C C C C C
charge: -0.045068 0.226119 -0.241491 -0.097755 0.122974 0.010569 -0.140964 0.446527 -0.381903 0.134746 -0.066693 0.081791 -0.074459 0.025608
polarizability: 2.10165042e+02 5.40766164e-01 1.36386177e+02 -1.80477501e+00 -4.28997055e+00 8.80415320e+01
1716.lowfreq: -12.6463 -5.4100 -0.0025 -0.0022 -0.0014 5.1326 55.2329 70.8832 89.4253
frequency: 55.2007 70.8123 89.4133 143.9721 171.2931 204.1399 239.2503 251.9006 266.2241 294.6138 348.8301 364.3668 406.1094 422.5488 468.3411 491.5373 527.5263 564.5375 576.6034 595.5045 643.6469 668.9178 705.0611 729.8965 774.1390 820.3447 838.2817 873.5234 887.0276 923.6118 953.5591 959.7941 1024.2436 1032.8919 1077.1340 1078.7276 1129.0011 1130.1724 1182.6519 1218.3394 1241.5684 1242.7627 1279.7829 1299.5130 1339.9130 1342.1385 1352.3275 1374.4277 1428.0078 1433.8379 1451.7653 1454.9943 1458.9683 1557.4824 1581.9533 1622.8018 2981.2821 3008.7788 3021.7053 3053.8982 3072.2929 3098.3198 3155.5401 3166.2522 3181.2887 3501.3371
redmass: 5.6688 10.9894 4.3841 3.3567 6.2510 8.1861 3.9076 3.6518 3.4982 9.9193 5.9242 7.5171 2.1692 3.9415 3.4751 2.8149 2.6964 5.0288 2.3382 5.3027 5.7810 3.2500 5.6068 4.4823 3.0485 1.3555 1.5886 1.7907 2.3093 3.4830 2.2803 1.3543 1.8743 6.3944 2.1923 1.9602 1.3936 1.3149 1.2377 1.6609 1.3036 1.7924 1.2676 1.4621 2.8166 1.4813 2.6234 2.5928 2.5871 1.1013 1.8687 1.1874 1.2320 7.2664 7.4933 5.7975 1.0631 1.0603 1.0598 1.0973 1.1028 1.1064 1.0894 1.0929 1.0968 1.0752
irintensity: 1.6880 1.9671 0.1617 1.1315 2.2692 2.4925 0.0596 1.5415 4.0119 4.9630 3.6875 0.8813 7.3007 4.1389 9.3597 26.4650 33.2461 6.7052 49.8792 3.1714 5.3139 38.3353 20.8403 3.0957 20.2327 39.2835 5.5112 8.9576 12.2942 35.5845 33.0028 0.3471 4.2146 9.5685 11.8078 34.9815 18.9099 14.4301 35.4289 51.8400 3.6212 5.4411 2.2920 38.4337 16.9813 24.6936 58.7644 34.7310 14.7004 15.0318 53.4034 65.6768 21.4217 37.3269 136.5110 304.6094 34.9896 12.4133 26.2538 11.2563 18.7512 15.8475 1.1820 0.3063 1.4717 32.3387
temp: 298.150 k
press: 1.00000 atm
elementType: 17 16 8 7 6 6 6 6 6 6 6 6 6 6 1 1 1 1 1 1 1 1 1 1
symmnumber: 1
zpe: 471966.5 jmol-1
zpe.correction: 0.179763 hartree
zpe.thermalcorrener: 0.192440 hartree
zpe.thermalcorrenthalpy: 0.193384 hartree
zpe.thermalcorrgfe: 0.140191 hartree
zpe.sumelectzpe: -1374.152475 hartree
zpe.sumelectthermal: -1374.139797 hartree
zpe.sumelectthermalent: -1374.138853 hartree
zpe.sumelectthermalfe: -1374.192047 hartree
dipole: -0.9906 -2.3554 2.3292
dipole: 3.4575
quadrupole: -105.4092 -95.6607 -96.0729
quadrupole: -8.1232 9.1812 -1.9863
quadrupole: -6.3616 3.3869 2.9747 -8.1232 9.1812 -1.9863
hfenergy: -1374.3322373 hartree
pointgroup: C01 [X(C10H10Cl1N1O1S1)]
dipole: 0.4649298 -0.9569738 -0.8475773 debye
dipolederiv: -0.7865018 -0.242593 0.1551478 -0.3152457 -0.2418477 0.0739291 0.2151407 0.069247 -0.1116415 -0.2219331 0.0655171 -0.0919923 0.0006266 -0.1380062 -0.0446461 -0.1479462 -0.0388567 0.0220725 -1.0816999 0.3515288 0.0379481 0.431117 -0.6781847 -0.160042 0.214668 -0.2450977 -0.5171199 -1.4304533 0.3461965 0.0575511 0.1329257 -0.4653302 0.0248305 -0.2724193 0.1679194 -0.3347867 0.0709224 0.0636362 -0.0003349 -0.0232965 0.0965113 -0.0025987 -0.135777 -0.0075056 0.003468 -0.0027787 -0.0795625 -0.0914521 -0.0627172 -0.1116691 -0.1082725 -0.027083 -0.1377035 -0.0997709 0.2439122 -0.0307612 0.1743003 -0.0372821 0.0708472 0.0538421 0.2836671 0.0783576 0.199951 0.6221803 -0.4034513 -0.0950089 -0.3823515 0.419359 -0.0075149 -0.2145319 0.0919048 0.083792 0.2056957 0.1786718 -0.1120153 0.3284027 -0.0698645 -0.0511226 -0.0138625 -0.0488961 -0.20437 1.9501298 -0.5964081 0.1022825 -0.1761453 0.546637 0.3032953 0.2202894 0.3323585 0.6246052 -0.5601598 0.0666141 0.0654215 -0.1126989 -0.0807474 0.021748 0.0577229 0.0007636 -0.1253708 0.0491693 0.0091391 -0.0313744 -0.1573531 0.040523 0.0097674 0.0270084 -0.031399 -0.0825752 1.1524603 0.3491905 -0.286726 0.4536352 0.402001 -0.1302218 -0.3562679 -0.1106402 0.035646 -0.3261814 -0.1759148 0.0412516 -0.1538806 -0.1694905 0.0383248 0.0608306 0.0451191 -0.1309236 0.0036931 0.0094398 0.0662286 0.055909 0.0430468 0.0003118 0.139391 0.0035741 0.0196836 -0.0195081 -0.0439847 -0.1182149 -0.0007846 0.0215082 -0.0235396 -0.1622431 -0.0601196 -0.0927265 0.0254914 0.0696061 -0.0699386 0.0650119 -0.0060006 0.0681805 -0.0455846 0.0481095 0.0188396 -0.0690832 0.0045313 0.1083018 0.0077831 0.0341495 -0.0614868 0.0871329 -0.05475 0.0357456 -0.0263558 -0.1109133 -0.0059385 -0.0860384 -0.0611157 0.0351413 -0.0462361 0.0364948 0.0589745 -0.0321702 0.0807561 0.0365864 0.0346677 0.0609937 -0.0212057 0.0099221 -0.0587228 -0.0867415 0.052852 0.0731107 -0.0229707 -0.0445572 0.2742401 -0.049846 0.0443983 -0.1210779 0.2267646 0.0941974 -0.0029695 0.0215355 -0.0042256 -0.0126916 0.0170582 0.0222405 0.02503 0.1590353 0.09176 -0.0350729 0.0229845 -0.0031039 -0.0346088 0.0168726 0.0103576 0.0243349 0.1341919 -0.0056387 0.0536933 0.0364269 0.0496016 0.0597402 -0.0028049 0.0291821 -0.0084443 0.1632567 unknown
polarizability: 208.3003092|8.8409817|137.8456594|-9.7629209|-1.6612269|88.4467826 unknown
InChI: InChI=1S/C10H10ClNOS/c11-7-3-4-9-8(6-7)12-10(13)2-1-5-14-9/h3-4,6,12H,1-2,5H2
charge 0 multiplicity 1
24 atoms
Cl 4.415933 1.060618 -0.708521
S  -1.139488 -1.671182 1.177129
O  -2.871142 1.997128 0.598447
N  -0.63255 1.42245 0.5774
C  -3.0036 -0.835291 -0.874107
C  -2.175204 0.44577 -1.158258
C  -2.156555 -2.023401 -0.403967
C  0.468999 0.552187 0.335642
C  0.367725 -0.864227 0.489043
C  -1.942273 1.30898 0.084881
C  1.71496 1.129152 -0.030217
C  1.506634 -1.668401 0.241651
C  2.826592 0.298505 -0.243733
C  2.746791 -1.102472 -0.126825
H  -3.78843 -0.597595 -0.133031
H  -3.521579 -1.140174 -1.806321
H  -2.754663 1.092474 -1.841848
H  -1.226951 0.186204 -1.662206
H  -2.786992 -2.883919 -0.120557
H  -1.436715 -2.350475 -1.173897
H  -0.516932 2.157536 1.282991
H  1.790333 2.212455 -0.162426
H  1.424011 -2.751624 0.373075
H  3.623595 -1.731498 -0.301145
