program: Gaussian 09
title: 000087882
version: EM64L-G09RevD.01
frameworkgroup: C1[X(C14H20N4O)]
method: RPBEPBE
basis: SDD
operation: Freq
keyword: #p
keyword: freq=noraman
keyword: PBEPBE/SDD
title: #p freq=noraman PBEPBE/SDD
converged: YES YES NO NO
title: Mulliken charges:
elementType: O N N N N C C C C C C C C C C C C C C H H H H H H H H H H H H H H H H H H H H
charge: -0.247082 -0.106333 -0.332905 -0.179110 -0.064583 -0.343099 -0.327590 -0.336899 -0.421892 -0.672051 -0.669115 0.200158 0.000267 0.332333 -0.348371 -0.369410 -0.226132 -0.227702 -0.233036 0.232631 0.202576 0.207902 0.191178 0.225466 0.194078 0.240796 0.247229 0.204419 0.228334 0.209896 0.206906 0.225617 0.208302 0.328878 0.264781 0.267189 0.229230 0.227560 0.229584
chargesum: 0.00000
title: Mulliken charges with hydrogens summed into heavy atoms:
elementType: O N N N N C C C C C C C C C C C C C C
charge: -0.247082 -0.106333 -0.004027 -0.179110 -0.064583 0.092108 0.071490 0.082644 0.066132 -0.029401 -0.028290 0.200158 0.000267 0.332333 -0.083590 -0.102221 0.003098 -0.000142 -0.003452
polarizability: 2.54026607e+02 2.42197494e+01 2.01018522e+02 -1.24270773e+01 4.74335064e+00 1.09205848e+02
1716.lowfreq: -4.4437 -0.0002 0.0002 0.0005 3.6604 5.2410 15.2298 24.7656 27.4305
frequency: 14.8298 23.9906 26.9152 57.5959 60.9927 82.4932 86.3262 98.2263 103.0752 168.2107 197.9281 206.5855 218.5836 258.2477 267.3636 296.9298 314.8931 327.1848 350.6383 391.9128 403.2005 421.3896 448.9539 455.6032 477.1332 483.7703 553.7215 614.6803 646.9416 664.2914 699.7897 713.4934 716.2301 747.2404 785.6224 787.9197 795.2934 799.0242 804.4839 861.9730 893.6839 914.4254 939.3137 944.1101 988.9391 989.6687 990.8580 1003.2873 1021.9520 1024.5083 1061.8668 1065.2680 1075.7611 1077.9089 1078.8812 1085.0329 1099.2858 1128.4966 1169.9923 1172.8800 1185.4165 1204.2717 1209.8882 1258.0822 1281.6418 1291.6877 1293.9117 1304.4688 1328.9684 1337.8282 1362.6604 1370.0507 1381.6928 1385.3616 1387.0960 1388.3266 1410.5451 1444.5602 1451.9507 1462.5033 1464.1146 1472.8687 1476.9246 1480.6058 1485.1406 1489.1916 1492.5639 1505.3765 1589.6821 1616.9182 1644.5372 2859.8837 2870.6258 2908.0904 2982.2863 2983.1111 3025.1203 3029.0067 3036.8578 3041.7328 3074.0757 3075.7039 3091.0230 3091.4491 3097.2320 3127.4521 3138.7812 3152.1009 3162.6300 3171.2679 3587.0102
redmass: 4.4002 3.6804 3.5246 3.5291 3.9157 2.9875 2.0678 6.4700 3.2154 1.7597 2.1719 1.6496 2.5196 1.9176 2.7163 2.1764 4.5908 6.0612 3.8828 2.6100 2.8390 3.6548 3.4511 1.3373 2.8872 3.4585 4.2857 6.4368 7.0352 5.4617 1.9834 4.4364 3.3910 2.5683 2.0433 1.6814 1.1455 2.5311 1.7245 1.2475 7.7622 2.1425 6.0384 1.4288 2.3066 6.0166 1.3838 1.3234 2.8646 3.5198 2.4028 2.4515 2.6239 1.7557 1.9744 2.1702 2.7579 1.8923 2.0793 1.0646 1.1244 2.7059 2.4074 1.4380 1.1644 1.3030 2.0795 1.1575 1.3206 1.8747 1.3336 1.3216 1.3775 6.0722 1.2577 1.2430 3.4329 2.3088 1.0826 1.0553 1.0584 1.0824 1.5497 1.0512 1.0808 1.0808 1.0846 3.4256 6.3728 6.0936 9.5979 1.0721 1.0712 1.0696 1.0356 1.0357 1.0883 1.0598 1.0873 1.0905 1.0983 1.0981 1.1003 1.1003 1.1064 1.0851 1.0888 1.0935 1.0963 1.1004 1.0775
irintensity: 0.1585 0.0253 0.0732 0.6093 0.7662 0.3332 0.2746 2.4079 1.7993 1.7826 0.8635 0.2999 0.7845 0.3074 0.9515 1.0443 1.1609 2.1580 4.1368 1.4157 0.0209 1.2906 6.1358 116.2831 27.5938 0.8074 15.3188 0.1336 3.5337 20.3121 35.7410 58.7670 3.9274 6.1553 29.7152 20.9600 4.5032 14.2861 6.6419 0.0201 10.1990 0.6414 5.4325 5.2835 3.2936 0.0455 0.0242 0.5178 24.2047 2.3929 29.8329 16.6823 10.2812 27.4829 6.6444 2.6882 2.5981 19.2735 37.6894 1.6155 15.9436 1.2400 60.7553 11.1477 10.9328 42.2767 36.7149 26.2569 13.4773 53.4758 1.8544 4.3401 11.5277 20.4742 23.3181 23.3418 150.3806 7.8180 14.7290 11.0803 0.7481 9.6900 40.0355 2.7226 24.0504 13.0506 11.7102 23.4659 1.8741 43.9616 587.8918 54.0922 117.6096 77.3683 35.9749 27.7245 10.0042 32.5107 11.6801 25.9976 33.2767 85.0105 27.1180 54.0715 22.2586 0.0290 12.0922 19.8849 16.8615 16.3539 89.5708
temp: 298.150 k
press: 1.00000 atm
elementType: 8 7 7 7 7 6 6 6 6 6 6 6 6 6 6 6 6 6 6 1 1 1 1 1 1 1 1 1 1 1 1 1 1 1 1 1 1 1 1
symmnumber: 1
zpe: 850090.8 jmol-1
zpe.correction: 0.323782 hartree
zpe.thermalcorrener: 0.343022 hartree
zpe.thermalcorrenthalpy: 0.343966 hartree
zpe.thermalcorrgfe: 0.273012 hartree
zpe.sumelectzpe: -838.234319 hartree
zpe.sumelectthermal: -838.215079 hartree
zpe.sumelectthermalent: -838.214135 hartree
zpe.sumelectthermalfe: -838.285089 hartree
dipole: -3.2758 1.3921 -0.2627
dipole: 3.5690
quadrupole: -102.4423 -109.6857 -117.4632
quadrupole: 13.3178 0.7875 -1.6280
quadrupole: 7.4214 0.1780 -7.5995 13.3178 0.7875 -1.6280
hfenergy: -838.5581011 hartree
pointgroup: C01 [X(C14H20N4O1)]
dipole: -1.313512 0.4667371 -0.1686993 debye
polarizability: 250.7250564|21.4014478|199.3298642|-23.9039147|-18.6535527|114.1960568 unknown
InChI: InChI=1S/C14H20N4O/c1-3-18(4-2)11-10-15-14-16-13(17-19-14)12-8-6-5-7-9-12/h5-9,15H,3-4,10-11H2,1-2H3
charge 0 multiplicity 1
39 atoms
O  0.787383 -2.88456 0.790138
N  -3.978454 0.411637 0.015753
N  -1.412166 -2.117107 1.238399
N  0.388867 -0.635509 0.550256
N  2.075006 -2.251966 0.379141
C  -3.096008 -0.773864 -0.079657
C  -5.205508 0.320062 -0.818951
C  -3.233913 1.69027 -0.166874
C  -2.453704 -1.072316 1.299998
C  -6.253413 -0.650562 -0.241941
C  -3.88591 2.87521 0.570363
C  -0.140633 -1.825734 0.861276
C  1.733802 -0.940434 0.268249
C  2.709984 0.088439 -0.126194
C  4.057723 -0.2570 -0.416104
C  2.29633 1.443153 -0.21642
C  4.975856 0.743908 -0.791582
C  3.220695 2.440534 -0.59302
C  4.561821 2.09527 -0.881694
H  -2.282589 -0.636179 -0.830009
H  -3.687919 -1.650269 -0.400638
H  -5.652072 1.329889 -0.864915
H  -4.963534 0.033862 -1.873831
H  -2.209736 1.544277 0.224565
H  -3.118605 1.934867 -1.252625
H  -3.234972 -1.389327 2.01168
H  -1.991373 -0.15189 1.695537
H  -5.869577 -1.685744 -0.182776
H  -6.542779 -0.335555 0.775699
H  -7.15711 -0.667734 -0.879443
H  -4.908515 3.078236 0.203448
H  -3.950044 2.661688 1.651542
H  -3.289896 3.795511 0.424609
H  -1.647475 -3.093963 1.409915
H  4.370234 -1.303956 -0.344007
H  1.255009 1.690427 0.01212
H  6.013854 0.473383 -1.014287
H  2.896935 3.48503 -0.660791
H  5.278703 2.870816 -1.173831
