program: Gaussian 09
title: 000087802
version: EM64L-G09RevD.01
frameworkgroup: C1[X(C5H7N7)]
method: RPBEPBE
basis: SDD
operation: Freq
keyword: #p
keyword: freq=noraman
keyword: PBEPBE/SDD
title: #p freq=noraman PBEPBE/SDD
converged: NO NO NO NO
title: Mulliken charges:
elementType: N N N N N N N C C C C C H H H H H H H
charge: -0.466119 -0.075545 -0.034246 -0.122861 -0.646424 -0.609863 -0.598103 0.126168 -0.037730 0.178478 0.115654 -0.043234 0.288166 0.328772 0.295977 0.311168 0.347589 0.324942 0.317213
chargesum: 0.00000
title: Mulliken charges with hydrogens summed into heavy atoms:
elementType: N N N N N N N C C C C C
charge: -0.177953 -0.075545 -0.034246 -0.122861 -0.021675 0.048893 0.044051 0.126168 -0.037730 0.178478 0.115654 -0.043234
polarizability: 1.64189854e+02 2.61935232e+00 1.16605425e+02 3.69172371e-03 -1.35450732e-03 4.31126394e+01
1716.lowfreq: -0.0011 -0.0005 -0.0002 8.3149 9.9976 10.9127 73.1901 114.9244 142.5223
frequency: 73.1858 114.9239 142.5116 201.1630 220.4889 223.4080 285.6202 298.6803 360.3615 387.0423 387.3794 431.8097 450.5609 458.4331 480.8764 513.0025 547.0499 576.0525 607.6221 637.3261 693.5862 709.7263 736.8754 775.2223 815.4114 909.7222 961.4717 1016.8913 1028.7907 1116.0788 1149.9936 1212.1735 1285.3567 1349.7984 1363.0488 1391.5133 1420.1588 1475.3804 1538.2752 1575.3299 1595.3867 1603.8020 1629.1831 1655.2284 3555.4712 3570.1938 3575.8540 3597.6266 3712.8975 3723.5120 3732.3340
redmass: 1.8326 1.8735 3.0513 1.3497 6.9848 3.5844 5.3010 2.8489 5.9869 2.9944 1.2010 1.1673 1.1687 7.2658 1.1677 1.0470 5.1428 5.0345 4.6012 8.8285 8.8783 11.3891 6.7229 12.2109 7.1170 2.5826 3.0881 2.3312 2.8723 2.1087 3.9647 2.3039 4.4992 4.4960 3.8910 5.1764 5.3767 3.1579 6.1237 1.8953 1.4318 1.4741 2.2466 3.9897 1.0453 1.0437 1.0454 1.0806 1.1039 1.1050 1.1060
irintensity: 29.0653 56.9850 19.8632 62.4140 8.7849 4.7297 11.1959 10.4518 0.5817 0.8496 225.7237 621.1450 38.5625 1.1211 77.9394 0.5022 0.1700 3.4036 0.3917 9.2644 1.3282 1.3521 6.5437 20.9793 1.8477 7.2694 5.1542 0.7569 7.2269 2.1532 39.9612 1.9191 47.0774 64.4415 222.3916 74.5394 12.5977 65.5801 677.9817 109.3540 490.3705 46.9202 783.3900 98.5891 69.6241 113.6456 108.8666 19.6308 24.2170 44.3533 42.3544
temp: 298.150 k
press: 1.00000 atm
elementType: 7 7 7 7 7 7 7 6 6 6 6 6 1 1 1 1 1 1 1
symmnumber: 1
zpe: 370087.5 jmol-1
zpe.correction: 0.140959 hartree
zpe.thermalcorrener: 0.152098 hartree
zpe.thermalcorrenthalpy: 0.153042 hartree
zpe.thermalcorrgfe: 0.104799 hartree
zpe.sumelectzpe: -577.159113 hartree
zpe.sumelectthermal: -577.147974 hartree
zpe.sumelectthermalent: -577.147030 hartree
zpe.sumelectthermalfe: -577.195273 hartree
dipole: 3.4791 5.8930 0.0016
dipole: 6.8433
quadrupole: -40.0566 -60.9620 -74.6462
quadrupole: 9.3042 0.0050 0.0037
quadrupole: 18.4983 -2.4071 -16.0913 9.3042 0.0050 0.0037
hfenergy: -577.300072 hartree
pointgroup: C01 [X(C5H7N7)]
dipole: 1.3721239 -2.3164941 -0.0006273 debye
dipolederiv: -0.7184814 0.0447322 0.0000481 -0.124388 -0.596135 -0.0000417 0.0000126 -0.0000313 -0.2852424 -1.4140518 0.0713163 0.0000108 0.2960465 -0.4163704 0.0000285 0.0000383 0.0000004 -0.3146029 -1.3094343 0.3896082 0.0000211 -0.1193236 -0.5061781 0.0000166 0.0000747 -0.0000036 -0.2598435 -0.9079403 0.2359412 0.0000085 0.5154198 -1.0442446 -0.0000103 0.0000215 -0.0000564 -0.2757728 -0.2066122 -0.1157627 -0.0001756 -0.2808837 -1.5067272 0.0001917 -0.0000878 0.0005499 -0.7601044 -1.8089778 -0.221098 -0.0001261 -0.0855292 -0.2088124 0.0000223 -0.0005456 -0.0000122 -0.7567368 -1.4136744 0.6038728 -0.0000083 0.6618895 -0.4634942 -0.0000464 -0.0000539 -0.0000151 -0.7572947 -0.0658852 -0.5110458 0.0000177 -0.5629692 -0.7559819 0.0000358 0.0000693 0.000035 -0.0018371 1.4680646 -0.2440746 -0.000021 0.2734519 0.6305302 -0.0000214 -0.0000586 0.0000182 0.0821839 1.0113063 0.2725088 0.0000258 0.213106 1.8809605 -0.0000948 -0.0000165 -0.0001047 0.2086295 2.1176719 0.1598743 0.0000552 -0.1685801 0.8476764 -0.0000359 0.0001132 -0.0000325 0.2088678 1.9075925 -0.6781031 -0.0000666 -0.6679844 0.9167027 0.000015 -0.0000998 0.0000051 0.1709887 0.1311226 -0.0104373 -0.0000064 0.0168142 0.095838 0.000019 -0.0000155 0.0000371 0.3681967 0.1769949 0.0225294 0.0000072 0.0343442 0.2208923 -0.0000437 -0.0000392 -0.0001505 0.3849447 0.0847888 0.0153641 0.000114 0.0256922 0.2197783 -0.0000413 0.0001109 -0.0002527 0.3885449 0.2399796 -0.000154 0.0000336 -0.039046 0.1204797 -0.0000377 0.0002333 -0.0000584 0.4107371 0.2505878 0.043731 0.0000249 0.096289 0.2061402 0.0000266 0.0001669 0.0000725 0.4008387 0.2007845 -0.0462606 0.0000186 -0.0762034 0.2091479 0.0000044 0.0000348 -0.0000064 0.3939297 0.2561638 -0.032542 0.0000184 -0.0081454 0.1497976 0.0000134 0.0000415 0.0000056 0.393573 unknown
polarizability: 164.1973027|-2.5507898|116.5979764|-0.0036898|-0.0013598|43.1126394 unknown
InChI: InChI=1S/C5H7N7/c6-2-1-3(11-4(7)9-1)12-5(8)10-2/h9H,6-8H2
charge 0 multiplicity 1
19 atoms
N  1.732916 -0.959166 -0.000021
N  1.578263 1.335626 -0.000084
N  -0.887248 1.482041 -0.000034
N  -2.04599 -0.698697 0.000088
N  -0.947555 -2.767281 0.000124
N  3.78139 0.367478 0.000001
N  -3.224215 1.322332 0.000104
C  0.347433 -0.649434 -0.000024
C  0.283235 0.784385 -0.000058
C  -0.861981 -1.382458 0.00003
C  2.406878 0.271969 -0.000061
C  -2.000682 0.680933 0.000058
H  2.159371 -1.882589 0.00009
H  -1.879285 -3.17634 0.000067
H  -0.131776 -3.370385 -0.000384
H  4.392558 -0.442241 -0.00027
H  4.179737 1.301964 -0.000252
H  -3.240055 2.337723 0.000098
H  -4.075793 0.770239 0.000228
