program: Gaussian 09
title: 000087792
version: EM64L-G09RevD.01
frameworkgroup: C1[X(C5H3BrOS)]
method: RPBEPBE
basis: SDD
operation: Freq
keyword: #p
keyword: freq=noraman
keyword: PBEPBE/SDD
title: #p freq=noraman PBEPBE/SDD
converged: NO NO NO NO
title: Mulliken charges:
elementType: Br S O C C C C C H H H
charge: 0.048907 0.305860 -0.186903 -0.153411 -0.143628 -0.011202 -0.511215 -0.111984 0.298425 0.291224 0.173927
chargesum: 0.00000
title: Mulliken charges with hydrogens summed into heavy atoms:
elementType: Br S O C C C C C
charge: 0.048907 0.305860 -0.186903 -0.153411 0.154797 -0.011202 -0.219991 0.061943
polarizability: 1.37001253e+02 -3.97339996e+00 9.41452127e+01 1.21377037e-02 1.80613090e-03 3.04717226e+01
1716.lowfreq: -9.6601 -7.0411 -0.0032 -0.0025 -0.0023 10.9501 120.6640 132.2646 164.7804
frequency: 120.6575 132.2315 164.7412 254.5619 258.6718 299.5878 398.3455 468.2844 563.9942 585.9931 751.9084 753.6876 796.6740 851.5321 885.4957 973.4130 1069.5581 1125.0895 1174.5424 1333.6065 1388.0652 1421.5544 1514.7337 1585.8144 2882.5535 3198.9375 3240.6515
redmass: 13.5416 6.8404 4.0919 7.7721 3.2893 11.7012 11.8999 4.9194 9.6760 3.1778 6.2184 1.2979 5.9245 6.2735 1.3774 1.7176 1.8440 3.0892 1.2421 3.6385 1.3693 7.5200 6.9662 6.4222 1.0851 1.0961 1.0965
irintensity: 3.3660 0.6809 7.6285 0.9489 5.5396 6.1945 2.3654 3.0206 19.5766 26.4823 42.6618 44.2879 24.8986 15.4419 20.8984 2.5719 11.4610 51.2900 26.8603 105.1115 40.9414 67.6296 41.1541 206.6803 91.3556 3.5404 3.8725
temp: 298.150 k
press: 1.00000 atm
elementType: 35 16 8 6 6 6 6 6 1 1 1
symmnumber: 1
zpe: 168642.9 jmol-1
zpe.correction: 0.064233 hartree
zpe.thermalcorrener: 0.071867 hartree
zpe.thermalcorrenthalpy: 0.072812 hartree
zpe.thermalcorrgfe: 0.030218 hartree
zpe.sumelectzpe: -678.470116 hartree
zpe.sumelectthermal: -678.462481 hartree
zpe.sumelectthermalent: -678.461537 hartree
zpe.sumelectthermalfe: -678.504131 hartree
dipole: -0.9560 3.0876 -0.0005
dipole: 3.2323
quadrupole: -65.9536 -63.7367 -64.5636
quadrupole: 8.2350 0.0007 0.0002
quadrupole: -1.2023 1.0146 0.1877 8.2350 0.0007 0.0002
hfenergy: -678.5343486 hartree
pointgroup: C01 [X(C5H3Br1O1S1)]
dipole: 0.7156763 1.0511699 0.0001992 debye
dipolederiv: -0.4496293 0.255682 -0.0001304 0.2948844 -0.1948266 0.0000847 -0.0002534 0.0001509 0.0179816 -0.0635674 0.2319508 -0.0000407 0.16093 -0.2621167 -0.0000074 0.0000244 -0.0000447 0.1817226 -0.9138404 -0.2117679 0.0000004 -0.6604748 -0.6607393 0.0000179 -0.0000156 -0.0000137 -0.3220425 -1.0575248 -0.0368118 -0.0000279 0.2368953 0.3996113 0.0000414 0.0000105 0.0000072 -0.1704531 0.065564 0.2763822 -0.0000659 0.1336104 -0.2139628 0.0000271 -0.0000948 0.0000675 -0.02727 0.7526471 -0.6268132 0.0003156 -0.7843878 0.1038029 -0.0002286 0.0003991 -0.0003116 -0.1151324 -0.1787566 -0.1893461 -0.0000213 0.0644015 0.146237 0.0001044 -0.0000085 0.0001931 -0.2420414 1.7043132 0.260538 0.0000047 0.3661863 0.709888 -0.0000413 0.0000181 -0.0000471 0.1492457 0.1249059 0.0003658 0.0000045 -0.0078294 0.0496002 0.0000131 0.000009 0.0000347 0.1958808 0.0516541 -0.0213139 -0.0000263 0.0057962 0.0981138 -0.0000284 -0.0000632 -0.0000712 0.2177688 -0.0357657 0.061134 -0.0000128 0.189988 -0.1756078 0.0000171 -0.0000256 0.000035 0.1143399 unknown
polarizability: 135.5463172|-8.7191663|95.6001486|0.0110752|-0.0052845|30.4717226 unknown
InChI: InChI=1S/C5H3BrOS/c6-4-1-5(2-7)8-3-4/h1-3H
charge 0 multiplicity 1
11 atoms
Br 3.077106 -1.25562 0.000566
S  -0.161412 1.890137 -0.000059
O  -2.853049 -1.128065 -0.000124
C  -0.858509 0.218686 -0.000153
C  0.148014 -0.752542 -0.00016
C  1.460911 -0.179985 -0.000135
C  1.482675 1.213009 -0.000096
C  -2.310875 0.013039 -0.000084
H  -0.06851 -1.822735 -0.000058
H  2.348141 1.872673 0.000197
H  -2.923292 0.950003 -0.000194
