program: Gaussian 09
title: 000087779
version: EM64L-G09RevD.01
frameworkgroup: C1[X(C5H13O3P)]
method: RPBEPBE
basis: SDD
operation: Freq
keyword: #p
keyword: freq=noraman
keyword: PBEPBE/SDD
title: #p freq=noraman PBEPBE/SDD
converged: YES YES NO NO
title: Mulliken charges:
elementType: P O O O C C C C C H H H H H H H H H H H H H
charge: 1.295774 -0.495814 -0.531453 -0.625127 -0.737965 -0.307273 -0.669581 -0.498393 -0.483959 0.253450 0.280253 0.220191 0.236334 0.207547 0.228090 0.214507 0.212356 0.246431 0.239013 0.226164 0.254135 0.235319
chargesum: 0.00000
title: Mulliken charges with hydrogens summed into heavy atoms:
elementType: P O O O C C C C C
charge: 1.295774 -0.495814 -0.531453 -0.625127 -0.204261 0.149252 -0.019437 0.199407 0.231659
polarizability: 1.01629595e+02 1.19939866e+00 8.59734251e+01 9.20721700e-01 -2.50339101e+00 7.59438742e+01
1716.lowfreq: -15.7458 -7.2332 -4.3025 -0.0020 -0.0015 0.0010 44.3012 64.3696 73.6045
frequency: 44.0822 64.3161 73.0938 76.3682 89.3355 94.3648 134.7874 181.3678 183.7340 231.3463 245.0553 277.2800 292.1680 327.6341 373.4455 454.9937 578.3864 651.0187 729.6530 752.2492 851.9618 902.7224 966.1272 971.7235 1025.7066 1053.8067 1087.9981 1100.0439 1110.1203 1115.2349 1127.2336 1135.4649 1217.0225 1261.6939 1295.3614 1347.5277 1394.5716 1420.8606 1425.7008 1431.4069 1460.4217 1464.7790 1471.7250 1476.2738 1477.2942 1478.1798 1489.6208 2963.4877 2978.1486 2981.6859 2997.2361 3023.4541 3042.9668 3059.7755 3075.2062 3081.6354 3081.9078 3094.5506 3116.5429 3122.6523
redmass: 2.9736 2.8564 1.2316 1.7385 1.9792 3.3734 1.2075 3.4635 4.3035 2.0148 1.4932 3.7664 3.9478 6.3817 5.2527 6.1785 6.8992 10.0946 3.5617 1.1991 1.2729 2.0266 9.9524 10.2584 2.6376 2.6490 2.0340 2.1412 1.2501 1.2591 1.3004 1.3337 1.3793 1.2769 1.0929 1.4128 1.2061 1.1013 1.1193 1.0961 1.0508 1.0529 1.0525 1.0474 1.0455 1.0432 1.0880 1.0330 1.0358 1.0297 1.0606 1.0581 1.1011 1.1013 1.1015 1.0993 1.1051 1.1039 1.1018 1.1036
irintensity: 1.2737 4.2490 0.6465 0.7922 3.1654 1.8832 1.0235 2.4253 28.4392 0.9509 0.6488 9.1826 0.9698 17.8539 3.9161 33.7722 49.9070 140.9762 38.0182 31.0876 3.2377 1.5778 206.8558 143.2799 35.0300 3.6105 70.9102 30.4037 0.5864 3.2258 0.9079 1.5540 2.4525 7.2405 0.1747 0.1926 10.3859 2.7008 2.0479 11.3110 13.6132 9.6173 14.9440 10.9486 11.6160 3.7799 14.5320 54.7986 37.3503 52.3398 11.1160 10.7962 0.2422 42.3918 34.1035 38.3628 28.3073 25.8255 16.0873 17.0984
temp: 298.150 k
press: 1.00000 atm
elementType: 15 8 8 8 6 6 6 6 6 1 1 1 1 1 1 1 1 1 1 1 1 1
symmnumber: 1
zpe: 472731.4 jmol-1
zpe.correction: 0.180054 hartree
zpe.thermalcorrener: 0.193347 hartree
zpe.thermalcorrenthalpy: 0.194291 hartree
zpe.thermalcorrgfe: 0.139345 hartree
zpe.sumelectzpe: -764.439437 hartree
zpe.sumelectthermal: -764.426144 hartree
zpe.sumelectthermalent: -764.425200 hartree
zpe.sumelectthermalfe: -764.480146 hartree
dipole: 0.9314 1.9944 -3.7693
dipole: 4.3649
quadrupole: -52.9445 -60.6528 -72.2698
quadrupole: -0.6730 2.8594 1.8841
quadrupole: 9.0112 1.3029 -10.3141 -0.6730 2.8594 1.8841
hfenergy: -764.6194909 hartree
pointgroup: C01 [X(C5H13O3P1)]
dipole: -0.3652686 -0.6141024 -1.561589 debye
dipolederiv: 1.9201269 0.0145498 -0.1549348 0.074414 1.9182974 0.178513 -0.3083911 -0.1804447 1.3268013 -0.655942 0.1314697 0.0515605 0.0821453 -1.2671525 -0.2596811 0.0358818 -0.2737024 -0.5710845 -1.3765496 -0.321592 0.218989 -0.3287152 -0.6978804 0.0353359 0.2823608 0.1546694 -0.629476 -0.741219 -0.0148659 -0.0121002 0.0088722 -0.6407312 -0.0673589 0.0379976 -0.0350962 -0.6565146 -0.2108288 -0.0074633 -0.0001898 -0.0484717 -0.1615927 -0.0020353 0.0036719 0.0471039 -0.1476816 0.0439128 -0.0101829 -0.005054 0.06135 0.1197741 0.0094205 -0.2146267 0.0008591 0.059389 -0.0897979 -0.0101318 -0.0251988 -0.04985 0.0963898 0.0151579 0.0598813 0.0193379 0.0732788 0.3055978 -0.001035 -0.0091579 -0.0188835 0.4591439 0.1342959 -0.0686532 0.4313998 0.349989 0.7495608 0.1934431 -0.1200467 0.1684716 0.3236866 -0.061001 0.1714589 0.0522537 0.1392802 0.035891 -0.0194874 -0.0181723 -0.0047341 0.0517936 -0.0968564 0.0286869 -0.0750253 -0.0590962 0.0423946 0.0665673 -0.0093511 -0.003727 -0.0520154 0.0526708 -0.0028657 0.0482563 0.0759356 0.0422606 0.0562 -0.0198877 0.0277864 -0.117827 0.0695733 -0.0052355 0.0416171 0.0657507 0.0617289 -0.0201857 -0.0251278 0.0026541 0.0384248 -0.0978269 0.0152296 -0.0722152 -0.0684409 0.0782344 0.0254734 0.0187354 -0.0011716 0.0186559 -0.1202381 -0.0456857 -0.1121148 -0.1085791 -0.1301793 -0.0600179 0.0824191 -0.0793095 0.0761377 0.0519461 0.114595 0.0545696 0.010818 0.0736723 0.0127242 -0.0186888 0.0791615 -0.1467152 0.0638963 -0.0436282 0.0490984 0.0722506 -0.1366 -0.0741349 -0.1084881 -0.0111334 0.0381898 -0.0361932 -0.0777178 -0.1082873 -0.0114717 0.0850115 0.0758496 -0.0253466 0.0787431 -0.1258903 0.0260222 -0.0231183 0.0239425 0.0644165 -0.0103453 -0.0229234 0.0983887 -0.0646655 0.0616207 0.0500545 0.1096768 -0.0552286 -0.0504337 -0.1215537 0.0440184 -0.0048301 0.1251281 -0.0616905 0.0325605 -0.0659317 0.0206965 0.094674 0.0467451 0.0102207 0.0328157 -0.0303306 0.018786 -0.0756713 -0.0736895 -0.1399607 0.0093111 -0.0121211 -0.068496 0.0536663 -0.067734 0.0505948 0.0974152 0.0701028 0.1082709 -0.0391162 unknown
polarizability: 100.9808592|3.2867314|85.6228105|-2.1935952|3.5138737|76.943225 unknown
InChI: InChI=1S/C5H13O3P/c1-4-5-9(6,7-2)8-3/h4-5H2,1-3H3
charge 0 multiplicity 1
22 atoms
P  0.360859 0.531776 0.215225
O  0.701856 -1.160556 0.504669
O  1.400686 0.976135 -1.117721
O  0.561019 1.3701 1.550276
C  -1.301828 0.600303 -0.630642
C  -2.436996 0.075439 0.275955
C  -3.810711 0.199636 -0.417214
C  0.80122 -2.086244 -0.640781
C  2.750309 1.49538 -0.797576
H  -1.222347 0.020869 -1.567689
H  -1.463537 1.659331 -0.899442
H  -2.244163 -0.980787 0.545696
H  -2.441504 0.64523 1.224472
H  -3.840585 -0.378803 -1.359675
H  -4.615218 -0.179753 0.237937
H  -4.041744 1.253508 -0.659973
H  -0.189937 -2.265245 -1.102848
H  1.179658 -3.028173 -0.215415
H  1.5028 -1.705633 -1.405513
H  3.445143 0.6629 -0.584926
H  2.708615 2.176934 0.070978
H  3.073705 2.03875 -1.698293
