program: Gaussian 09
title: 000007946
version: EM64L-G09RevD.01
frameworkgroup: C1[X(C6H12O3)]
method: RPBEPBE
basis: SDD
operation: Freq
keyword: #pfreq=noraman
keyword: PBEPBE/SDD
title: #p freq=noraman PBEPBE/SDD
converged: YES YES NO NO
title: Mulliken charges:
elementType: O O O C C C C C C H H H H H H H H H H H H
charge: -0.263932 -0.273821 -0.259503 0.006899 -0.267690 -0.693882 0.292267 -0.493463 -0.754717 0.231330 0.185190 0.209447 0.239381 0.208167 0.257454 0.234942 0.203749 0.198914 0.248097 0.248316 0.242855
chargesum: 0.00000
title: Mulliken charges with hydrogens summed into heavy atoms:
elementType: O O O C C C C C C
charge: -0.263932 -0.273821 -0.259503 0.238229 0.126947 0.011120 0.292267 0.144141 -0.015448
polarizability: 9.37758913e+01 -3.66058050e-01 7.30682513e+01 -9.16446564e-01 -3.03864024e+00 6.18243659e+01
1716.lowfreq: -12.3183 -4.9157 -0.0008 -0.0007 -0.0005 7.5267 16.9382 50.9990 55.1490
frequency: 10.9142 50.9925 55.0996 87.2087 114.2351 169.0372 207.4815 218.9919 231.9396 297.7611 318.2142 400.5091 436.8780 559.5441 585.2637 625.7287 767.5121 854.6248 885.7860 931.8941 944.2330 997.8938 1042.9841 1045.1130 1070.6092 1096.2950 1118.6690 1162.9716 1165.4867 1204.3225 1230.8235 1327.7318 1334.1032 1373.7347 1382.8984 1388.7201 1438.2832 1453.3837 1455.2760 1457.2483 1459.0244 1469.3114 1471.0291 1479.7808 1640.6426 2913.0615 2924.9411 2973.8906 2995.2011 3000.0056 3005.4193 3020.9954 3093.3820 3099.1356 3104.1287 3124.9370 3139.1531
redmass: 1.0401 6.0586 3.0199 2.3324 3.3886 2.8798 1.8789 1.2189 1.8275 2.3105 3.0876 2.8468 2.9115 3.8861 3.6238 3.4834 3.5417 3.4158 3.3898 2.9392 1.6927 1.8034 1.7973 2.5721 2.1467 1.6295 1.3409 1.5690 2.2325 2.8707 1.1781 1.3170 1.6630 1.3224 1.2423 1.2470 1.1468 1.0602 1.0542 1.0668 1.0580 1.0495 1.0574 1.0652 9.5090 1.0533 1.0394 1.1017 1.1023 1.0373 1.0382 1.0845 1.0976 1.0940 1.0969 1.1013 1.1025
irintensity: 0.5062 1.8293 1.6103 9.6358 3.4336 8.1496 1.6250 2.6044 1.6613 3.8957 1.0306 4.4593 6.6271 5.1995 6.9923 0.1806 8.4581 7.8162 25.4638 45.1750 0.6391 69.9782 32.7992 62.9052 92.0406 12.3241 9.7464 2.2355 24.4883 341.4877 7.3396 2.8856 1.4929 11.4268 54.1397 22.0227 0.4228 18.7972 22.3529 14.6337 18.8683 4.5716 11.4935 9.7620 189.4790 48.6810 105.4641 62.9818 61.8611 20.7641 2.7999 21.2370 28.6294 9.7924 29.2261 10.7702 9.8117
temp: 298.150 k
press: 1.00000 atm
elementType: 8 8 8 6 6 6 6 6 6 1 1 1 1 1 1 1 1 1 1 1 1
symmnumber: 1
zpe: 457059.8 jmol-1
zpe.correction: 0.174085 hartree
zpe.thermalcorrener: 0.185710 hartree
zpe.thermalcorrenthalpy: 0.186654 hartree
zpe.thermalcorrgfe: 0.134258 hartree
zpe.sumelectzpe: -460.748897 hartree
zpe.sumelectthermal: -460.737272 hartree
zpe.sumelectthermalent: -460.736328 hartree
zpe.sumelectthermalfe: -460.788724 hartree
dipole: -2.2434 -1.3173 -0.6967
dipole: 2.6932
quadrupole: -51.6288 -53.2963 -54.1976
quadrupole: -5.3323 6.5940 0.9119
quadrupole: 1.4121 -0.2554 -1.1567 -5.3323 6.5940 0.9119
hfenergy: -460.9229816 hartree
pointgroup: C01 [X(C6H12O3)]
dipole: -0.913803 0.4619197 0.2726348 debye
dipolederiv: -1.6122073 -0.2680804 -0.0918465 -0.26441 -0.591627 0.0044218 -0.0278944 0.005105 -0.3342318 -0.9425025 0.2308143 -0.0922326 0.2753349 -0.5384857 0.0423166 -0.1923727 0.0975234 -0.4475738 -0.8483395 -0.0058868 -0.0862835 0.3362271 -0.7413564 0.2006092 -0.1871482 0.1488644 -0.403832 0.6137565 0.1986429 -0.0204961 0.4551534 0.4622561 0.0743973 -0.1235566 0.0349198 0.3399464 0.4445103 -0.0598214 0.1481218 -0.0866123 0.4040005 -0.1397028 0.3558718 -0.1721684 0.4274347 -0.0637361 0.0011579 0.0178221 -0.0779729 -0.048217 -0.0722602 0.044167 -0.0986917 -0.1003839 1.915275 0.2444857 0.1800429 -0.1893655 0.9727476 -0.3268309 0.2575236 -0.2804551 0.3232004 0.7049723 -0.1254861 -0.0131995 -0.1370949 0.4263408 0.0181365 -0.1315603 0.0613836 0.2365164 -0.1639271 -0.1781458 0.0538062 -0.1787859 -0.2476122 0.1030156 0.0955026 0.1740357 -0.0267095 0.0181678 0.0289363 -0.0732855 -0.0618695 0.0015905 0.0416109 0.0004627 0.0523339 -0.0669827 -0.0973132 -0.1101878 0.0567343 -0.0546966 -0.1113367 0.1380988 -0.0416202 0.108185 -0.0268664 0.0349384 0.0267201 -0.0194304 0.0131879 -0.0832746 -0.1568231 -0.1005165 -0.0625962 -0.1016783 -0.0927118 0.0888523 0.0663342 0.0686678 0.083474 -0.0247546 0.0413249 -0.020528 0.0700106 0.0167097 -0.1373068 0.0218305 -0.1485894 -0.0627042 0.0170057 0.0045075 0.0364565 0.0721588 0.1145921 0.0193197 -0.0618109 0.0335668 0.0567761 0.0897143 -0.0555665 0.0431888 -0.0194583 -0.0016352 0.0547032 -0.0702421 0.0656489 0.0776143 0.0539831 -0.1184696 0.072946 -0.0680722 -0.0169394 -0.017953 -0.0412142 0.0492268 -0.1258999 -0.1237758 0.0669273 -0.1869131 -0.0282182 -0.1298347 -0.0394895 0.0551404 -0.1325333 -0.0853536 0.0917016 0.1627501 0.061899 0.0235045 0.0385301 0.1057974 0.0317032 0.0635085 -0.0188241 -0.0184287 0.0099466 -0.0489423 0.1246205 0.1105988 -0.0209483 0.0271636 -0.0114797 0.0902984 -0.0339805 0.0489698 -0.007173 -0.0632054 -0.0429044 -0.0361237 -0.0886582 -0.0171123 0.0795932 0.0215453 -0.1092489 -0.0193734 0.0698201 unknown
polarizability: 93.5747847|1.1775512|73.5079112|2.404403|-2.0919558|61.5858126 unknown
InChI: InChI=1S/C6H12O3/c1-5(4-8-3)9-6(2)7/h5H,4H2,1-3H3
charge 0 multiplicity 1
21 atoms
O  0.630205 0.445103 0.030776
O  -2.312236 0.207137 -0.450223
O  2.546121 -0.737899 0.654212
C  -0.207245 -0.778069 0.297571
C  -1.584211 -0.271778 0.72247
C  -0.21645 -1.670629 -0.949094
C  2.00688 0.312949 0.233438
C  -3.609989 0.773405 -0.096325
C  2.724745 1.590789 -0.145327
H  0.262028 -1.310185 1.147781
H  -2.141126 -1.110041 1.202087
H  -1.463908 0.543351 1.469282
H  0.805574 -2.015145 -1.178581
H  -0.850543 -2.558367 -0.770763
H  -0.630943 -1.119448 -1.807438
H  -4.072042 1.100653 -1.040799
H  -3.502549 1.646632 0.582421
H  -4.266385 0.020931 0.392953
H  2.086389 2.470035 0.031568
H  2.973251 1.562872 -1.222255
H  3.664035 1.670803 0.422747
