program: Gaussian 09
title: 000087735
version: EM64L-G09RevD.01
frameworkgroup: C1[X(C8H6N2O)]
method: RPBEPBE
basis: SDD
operation: Freq
keyword: #pfreq=noraman
keyword: PBEPBE/SDD
title: #p freq=noraman PBEPBE/SDD
converged: NO NO NO NO
title: Mulliken charges:
elementType: O N N C C C C C C C C H H H H H H
charge: -0.265070 -0.030602 0.045322 0.364965 0.297881 -0.380980 -0.360422 -0.319797 -0.415230 -0.211901 -0.233035 0.243490 0.242292 0.285332 0.261737 0.237317 0.238703
chargesum: 0.00000
title: Mulliken charges with hydrogens summed into heavy atoms:
elementType: O N N C C C C C C C C
charge: -0.265070 -0.030602 0.045322 0.364965 0.297881 -0.137490 -0.118130 -0.034465 -0.153494 0.025416 0.005668
polarizability: 1.80990239e+02 2.61107998e+00 1.08416545e+02 1.62735536e-03 2.10493390e-03 3.94889892e+01
1716.lowfreq: -13.8952 -10.9838 -0.0001 0.0005 0.0007 9.6086 103.3565 176.6263 269.2971
frequency: 103.3470 176.6250 269.2952 295.2690 405.2193 430.3170 459.5615 484.7906 532.2405 543.3480 620.7832 660.1182 710.4117 758.4546 759.1245 767.5884 817.1591 832.5046 874.3460 913.6859 915.5139 968.1811 997.1725 1017.1823 1115.8762 1146.8455 1179.6354 1216.4128 1257.0926 1261.4432 1303.8350 1338.9343 1414.2438 1425.3651 1443.3148 1479.6783 1550.8384 1563.6527 1627.9003 3124.9398 3131.9016 3137.3664 3153.7808 3170.9288 3193.5599
redmass: 6.6091 5.0667 4.5360 5.5304 3.5775 8.3665 2.5021 8.2319 3.5555 7.5230 6.9855 4.5900 7.1514 6.4983 1.5542 2.3589 4.5689 1.4018 1.4811 5.4939 1.4526 1.3953 1.3445 2.3723 2.7374 2.0761 1.1397 1.5641 1.5590 2.4134 1.7269 3.3624 3.1643 2.7373 5.6618 3.1471 5.7578 6.1361 6.5509 1.0916 1.0865 1.0890 1.0955 1.1004 1.0931
irintensity: 1.2287 0.1086 1.7959 0.6499 1.2195 2.9526 22.0401 1.2574 1.4523 0.5100 11.9047 5.4692 1.2539 6.4475 34.3415 16.2764 4.0740 46.2366 18.2150 3.8649 10.3769 6.0534 0.0146 7.1885 21.2347 14.6036 9.3822 10.5908 23.0018 18.9579 12.0350 121.8060 6.0826 52.5936 7.4813 3.7489 79.8552 25.7225 61.0727 5.7254 2.8909 2.1193 20.4617 20.6105 0.2526
temp: 298.150 k
press: 1.00000 atm
elementType: 8 7 7 6 6 6 6 6 6 6 6 1 1 1 1 1 1
symmnumber: 1
zpe: 326280.2 jmol-1
zpe.correction: 0.124274 hartree
zpe.thermalcorrener: 0.132028 hartree
zpe.thermalcorrenthalpy: 0.132972 hartree
zpe.thermalcorrgfe: 0.091611 hartree
zpe.sumelectzpe: -492.346066 hartree
zpe.sumelectthermal: -492.338313 hartree
zpe.sumelectthermalent: -492.337368 hartree
zpe.sumelectthermalfe: -492.378729 hartree
dipole: 6.5385 -0.2410 0.0000
dipole: 6.5430
quadrupole: -75.4132 -53.2510 -66.1068
quadrupole: 0.9264 0.0003 0.0003
quadrupole: -10.4895 11.6727 -1.1832 0.9264 0.0003 0.0003
hfenergy: -492.47034 hartree
pointgroup: C01 [X(C8H6N2O1)]
dipole: -2.5737433 0.0483042 0.0000053 debye
dipolederiv: -1.3400503 -0.1738132 0.000055 -0.4181986 -0.3232088 0.000021 -0.0001224 -0.0000107 -0.2802283 1.4850881 0.445742 -0.0000493 0.3649096 0.2221051 -0.0000084 0.0001646 -0.0000143 0.1149703 -0.4402901 -0.0680561 0.0000045 -0.387227 -0.1491202 -0.0000222 -0.0000017 0.0000074 -0.1949416 0.5498087 0.1499133 -0.0000215 -0.0589283 -0.0220574 -0.0000029 -0.0000212 -0.0000073 0.076132 -0.2684505 0.1825077 -0.0000035 0.0722309 -0.3183153 0.0000156 -0.0000106 0.0000215 0.0542513 -0.3312722 -0.0793161 0.0000059 0.0559885 0.1367509 -0.0000051 0.000014 0.0000054 -0.17576 0.1281703 -0.1360835 0.0000033 0.108589 0.1519138 -0.0000102 -0.0000052 -0.0000101 -0.1331411 -0.5349554 -0.1761841 -0.0000071 0.3396184 0.0854383 0.0000029 -0.0000326 0.0000137 -0.1182212 0.4668449 -0.2042602 0.0000067 -0.0600845 0.3190117 -0.0000171 -0.0000041 -0.0000034 -0.0103316 0.1591654 -0.0287417 -0.0000056 -0.0674316 0.2010548 -0.0000076 -0.0000059 -0.000007 -0.1206272 -0.0439812 0.1651461 -0.0000078 0.0844527 -0.1923842 0.0000033 -0.0000081 -0.0000017 -0.1712899 0.0716353 -0.0579603 0.0000027 0.001801 -0.0732317 0.000004 0.0000042 0.0000057 0.1612958 0.0831495 0.0169236 0.0000002 -0.0495538 -0.0831241 0.0000079 0.0000023 0.0000087 0.1592992 0.0556863 0.0102918 0.0000076 -0.009721 0.0117261 0.0000041 0.0000049 -0.0000067 0.1858069 0.0859758 -0.0770006 0.0000023 -0.0136535 -0.0545679 0.0000111 0.0000125 -0.0000031 0.1271018 -0.0424359 0.0998748 0.000001 0.1030305 0.0241028 0.0000005 0.0000015 -0.0000027 0.1581614 -0.0840887 -0.0689834 0.0000058 -0.0658224 0.0639061 0.0000031 0.0000077 0.0000046 0.1675223 unknown
polarizability: 180.8721244|3.9212002|108.53466|-0.001589|-0.002134|39.4889892 unknown
InChI: InChI=1S/C8H6N2O/c11-10-6-8-4-2-1-3-7(8)5-9-10/h1-6H
charge 0 multiplicity 1
17 atoms
O  3.401355 0.73519 -0.000029
N  2.172556 0.292931 -0.000124
N  2.013948 -1.136624 0.000025
C  -0.241249 0.650742 -0.000024
C  -0.439716 -0.78029 0.00002
C  -1.389621 1.510658 -0.000015
C  -1.75933 -1.321685 0.000053
C  1.08966 1.142546 -0.000083
C  0.74853 -1.584654 0.000057
C  -2.671736 0.955757 0.000016
C  -2.86478 -0.464318 0.000046
H  -1.248484 2.597002 -0.000034
H  -1.892397 -2.409836 0.000089
H  1.345279 2.203266 -0.000101
H  0.677318 -2.679812 0.000113
H  -3.54879 1.612287 0.000019
H  -3.881744 -0.869259 0.000073
