program: Gaussian 09
title: 000087765
version: EM64L-G09RevD.01
frameworkgroup: C1[X(C14H18O2)]
method: RPBEPBE
basis: SDD
operation: Freq
keyword: #pfreq=noraman
keyword: PBEPBE/SDD
title: #p freq=noraman PBEPBE/SDD
converged: YES YES NO NO
title: Mulliken charges:
elementType: O O C C C C C C C C C C C C C C H H H H H H H H H H H H H H H H H H
charge: -0.317519 -0.200872 -0.176638 -0.421849 -0.424892 -0.420740 -0.398428 -0.379235 0.175170 0.261748 0.333641 -0.357548 -0.385372 -0.816247 -0.218466 -0.234812 0.241812 0.215542 0.199966 0.200218 0.230029 0.244508 0.195143 0.199992 0.207316 0.184744 0.202452 0.247909 0.232570 0.224564 0.232777 0.264178 0.230631 0.227708
chargesum: 0.00000
title: Mulliken charges with hydrogens summed into heavy atoms:
elementType: O O C C C C C C C C C C C C C C
charge: -0.317519 -0.200872 0.065175 -0.006341 0.005355 0.018911 0.008880 0.007961 0.175170 0.261748 0.333641 -0.109639 -0.152803 -0.094728 0.012166 -0.007104
polarizability: 1.97800750e+02 3.82889857e+00 1.44806213e+02 4.32380705e+00 -6.89106178e+00 1.08424514e+02
1716.lowfreq: -39.8507 -13.7062 -2.8907 -0.0006 0.0002 0.0004 13.3933 44.2880 53.2423
frequency: -26.8111 44.0728 52.9488 76.6849 111.0123 141.5621 156.0777 191.0374 212.0634 250.4428 269.1643 292.2332 327.7963 362.5903 410.0995 424.0410 446.5649 454.2740 504.7779 527.1837 544.3512 603.9381 626.8496 701.0419 731.2076 732.4760 764.0105 777.5372 795.6972 806.3214 829.3367 861.4127 864.8950 867.5844 902.7122 927.1227 944.7020 983.4685 985.8426 1000.7709 1039.1365 1046.3805 1050.1478 1052.2607 1067.9926 1093.3319 1096.5025 1113.7741 1124.2452 1155.2227 1163.6320 1169.9567 1222.6657 1229.8774 1251.8907 1270.9600 1279.1346 1280.5152 1320.6750 1328.8428 1336.1822 1348.2431 1353.5879 1359.8148 1377.6546 1396.0050 1431.5081 1452.8631 1460.2101 1464.6393 1465.8186 1471.5414 1476.4908 1477.1230 1485.0681 1588.0789 1617.7681 1654.9185 2959.5124 2972.0000 2975.3444 2978.6197 2980.6690 2991.2541 3001.2757 3027.9966 3033.6499 3043.8101 3055.2972 3058.9796 3062.3045 3090.9369 3125.2625 3139.3577 3155.3969 3171.0930
redmass: 3.7024 4.4421 4.6490 4.9437 3.8541 3.1855 1.1509 2.5773 3.0851 2.5986 3.0611 4.2499 2.5588 1.9120 3.9377 3.5314 3.0841 2.9120 2.4972 3.3444 4.1592 5.4555 4.9291 4.3216 2.1626 3.9424 1.7737 1.5284 3.1289 3.5691 3.2575 2.3892 1.4044 1.6976 2.8447 1.3683 1.3911 1.3210 1.6165 2.9081 2.0561 2.0087 1.5757 1.6071 2.6357 1.8589 2.0370 1.2161 1.5996 1.7245 1.9328 1.0878 2.6061 1.3165 1.3845 1.2128 1.4700 1.3472 1.7217 1.3301 1.4352 1.4444 1.4147 1.4890 7.2846 1.2453 2.1757 1.0863 1.0863 1.0773 1.0846 1.0814 2.1694 1.1205 1.2004 6.0600 7.2828 10.7151 1.0638 1.0625 1.0651 1.0644 1.0370 1.0629 1.0807 1.0951 1.1003 1.0982 1.0999 1.1017 1.0975 1.0993 1.0867 1.0894 1.0944 1.1003
irintensity: 0.0095 0.7061 0.2901 1.0189 1.3221 0.3393 1.4733 2.5028 1.7132 3.3000 1.6125 3.8649 2.8557 0.2805 0.4207 1.8762 7.2756 5.8408 0.3185 1.3145 0.6792 0.6124 3.7937 1.2781 18.8995 5.7227 39.7869 0.7175 15.9660 19.2123 0.6187 6.5403 8.4046 16.1105 29.9320 9.3219 2.4767 0.0427 1.1794 91.2350 6.9091 133.7190 21.9203 5.6227 310.5362 29.2666 48.4287 16.6993 21.0843 19.1071 19.4227 1.3632 17.4062 7.2995 0.4580 2.4303 1.1425 4.0452 16.5738 1.3370 1.1215 1.7698 1.4783 7.5371 2.0945 9.3686 6.5732 10.2043 0.6530 21.6344 3.2532 32.1783 21.8814 18.3623 52.8172 11.7575 1.3132 127.6129 40.6244 27.6557 30.6013 18.3643 23.1051 43.4609 39.0949 60.5941 67.4700 25.0408 6.8420 95.4214 10.9309 23.0315 4.8972 11.4519 26.5927 16.3479
temp: 298.150 k
press: 1.00000 atm
elementType: 8 8 6 6 6 6 6 6 6 6 6 6 6 6 6 6 1 1 1 1 1 1 1 1 1 1 1 1 1 1 1 1 1 1
symmnumber: 1
zpe: 753069.1 jmol-1
zpe.correction: 0.286829 hartree
zpe.thermalcorrener: 0.301067 hartree
zpe.thermalcorrenthalpy: 0.302011 hartree
zpe.thermalcorrgfe: 0.245601 hartree
zpe.sumelectzpe: -693.548375 hartree
zpe.sumelectthermal: -693.534137 hartree
zpe.sumelectthermalent: -693.533193 hartree
zpe.sumelectthermalfe: -693.589603 hartree
dipole: 0.4695 0.2351 1.4424
dipole: 1.5350
quadrupole: -84.3025 -88.1984 -102.6924
quadrupole: -1.2274 3.0539 -2.3098
quadrupole: 7.4286 3.5327 -10.9613 -1.2274 3.0539 -2.3098
hfenergy: -693.8352042 hartree
pointgroup: C01 [X(C14H18O2)]
dipole: -0.1860655 -0.1836802 0.5443788 debye
polarizability: 197.7200383|5.12982|141.8670997|-3.228559|12.2215148|111.4443396 unknown
InChI: InChI=1S/C14H18O2/c1-11-7-5-6-10-13(11)16-14(15)12-8-3-2-4-9-12/h5-7,10,12H,2-4,8-9H2,1H3
charge 0 multiplicity 1
34 atoms
O  0.370355 0.488015 0.807541
O  -0.485631 0.600155 -1.370999
C  -1.986071 0.91597 0.599999
C  -3.112591 1.371944 -0.362569
C  -2.428549 -0.329246 1.43445
C  -3.673772 0.217157 -1.228461
C  -2.962818 -1.475177 0.543879
C  -4.117991 -0.984281 -0.361349
C  -0.677295 0.651684 -0.140543
C  1.717536 0.261579 0.356814
C  2.094165 -0.984513 -0.204595
C  2.640966 1.297971 0.592157
C  3.463899 -1.147116 -0.535193
C  1.088196 -2.092429 -0.439149
C  3.997863 1.108207 0.251215
C  4.408595 -0.11919 -0.316946
H  -1.759115 1.727916 1.319579
H  -2.745037 2.18581 -1.014896
H  -3.930932 1.792068 0.257181
H  -3.237532 0.001078 2.116945
H  -1.587973 -0.669892 2.065577
H  -2.89579 -0.107972 -1.944023
H  -4.527776 0.589877 -1.826427
H  -3.304024 -2.310992 1.184996
H  -2.14389 -1.873198 -0.089899
H  -4.975119 -0.683492 0.277527
H  -4.474358 -1.80931 -1.007849
H  2.28957 2.233698 1.03804
H  3.788804 -2.099996 -0.969607
H  1.596704 -3.044416 -0.665958
H  0.443005 -2.246261 0.445287
H  0.42739 -1.842902 -1.289977
H  4.722802 1.90977 0.428018
H  5.459012 -0.277516 -0.584264
