program: Gaussian 09
title: 000087764
version: EM64L-G09RevD.01
frameworkgroup: C1[X(C12H15OPS3)]
method: RPBEPBE
basis: SDD
operation: Freq
keyword: #p
keyword: freq=noraman
keyword: PBEPBE/SDD
title: #p freq=noraman PBEPBE/SDD
converged: NO YES NO NO
title: Mulliken charges:
elementType: S S S P O C C C C C C C C C C C C H H H H H H H H H H H H H H H
charge: 0.041867 0.259753 -0.213869 0.418878 -0.497489 0.414395 0.394572 -0.654768 -0.367456 -0.310270 -0.824315 -0.646973 -0.362451 -0.256588 -0.673669 -0.239754 -0.233445 0.281263 0.261359 0.232400 0.215439 0.270401 0.276718 0.292461 0.310678 0.246108 0.245893 0.223418 0.227828 0.207268 0.229395 0.230952
chargesum: 0.00000
title: Mulliken charges with hydrogens summed into heavy atoms:
elementType: S S S P O C C C C C C C C C C C C
charge: 0.041867 0.259753 -0.213869 0.418878 -0.497489 0.414395 0.394572 -0.112146 -0.367456 0.137569 0.015265 -0.336295 -0.116343 -0.010695 -0.015155 -0.010358 -0.002493
polarizability: 2.57120657e+02 3.64722639e+01 2.31299879e+02 -2.85073928e+00 2.94570855e+01 1.56029039e+02
1716.lowfreq: -24.9803 -9.1105 -0.0028 -0.0019 0.0019 5.3370 7.0957 14.8875 32.1818
frequency: -23.5887 14.3684 31.9741 37.3575 62.8428 79.3414 115.9385 122.6503 139.2415 163.7723 170.5577 176.8801 197.0799 204.2090 215.2975 218.8747 249.2706 273.4340 307.4172 332.3536 368.5836 398.2244 421.0159 458.5448 486.7318 496.0100 547.8579 558.9947 613.3071 660.5637 665.9287 688.1299 720.0977 736.6546 746.4221 754.6233 767.7695 782.8094 820.2679 852.1097 866.3329 895.5870 948.3008 953.6846 960.3287 985.0193 1016.1048 1024.2539 1038.8223 1048.5131 1076.9598 1100.2945 1127.6384 1161.4550 1177.7270 1216.2971 1235.0334 1258.6796 1288.9453 1329.2318 1337.9779 1347.1785 1386.8751 1395.4229 1426.4808 1428.8907 1430.4391 1449.3217 1456.8305 1472.2593 1475.9597 1483.1036 1518.0194 1574.9541 1602.4917 2976.9103 2998.2608 3019.0880 3021.9246 3048.5138 3076.0154 3080.9792 3101.6502 3131.2674 3141.7484 3145.6963 3151.0886 3154.0047 3168.4275 3241.0116
redmass: 2.3130 5.7253 5.4132 4.0737 2.8498 7.3626 4.2597 7.4079 4.3352 3.8910 1.7215 1.5904 4.7463 5.2315 2.1814 1.3978 4.9690 9.3328 9.5602 4.2115 8.8712 10.7946 3.1471 7.9561 5.4901 7.9673 10.5637 7.1733 3.8919 9.6745 5.3226 6.5982 7.1338 2.4904 1.0932 6.6393 1.6558 1.3274 4.3284 1.2006 1.3683 1.9161 1.3729 1.2978 1.3312 1.3124 2.3985 6.1799 2.8774 1.1841 4.0853 2.1910 1.4984 1.2340 1.1942 1.4008 1.2000 1.4999 1.1020 1.3623 1.1928 2.7768 1.2027 6.5626 2.5387 1.0475 1.0466 1.0853 3.1546 1.0524 1.0440 1.0779 7.0535 7.1740 6.9232 1.0353 1.0611 1.0560 1.0306 1.1004 1.1025 1.0990 1.1085 1.0851 1.0891 1.1024 1.1026 1.0954 1.1005 1.0966
irintensity: 0.1793 0.1287 0.3500 1.7376 0.1664 1.7718 0.8122 0.8864 1.8888 0.3694 0.2703 0.2863 3.9806 4.1450 0.3797 0.1789 3.2781 4.8930 15.1149 2.4174 7.0496 33.0632 17.7254 27.0553 3.5060 9.0119 75.7814 0.2683 1.4370 71.3191 17.3471 1.3156 17.8542 45.0796 11.0646 9.0306 62.4576 43.3156 86.8983 0.5410 2.5292 10.4644 0.8842 53.6767 60.9071 0.0782 14.3245 32.3748 2.1091 3.0155 95.8284 22.4696 3.5735 13.5976 0.1314 0.5066 9.3565 6.6851 0.1999 5.5813 26.0083 83.2739 12.4552 3.2054 18.5297 4.8568 11.1476 5.7786 7.5584 2.6318 11.7604 12.5819 35.8513 3.1444 1.6383 30.9354 12.5520 23.1975 0.8803 0.1258 37.9350 35.4395 29.7866 0.8350 4.8250 1.7838 0.9270 20.2533 23.2288 7.5540
temp: 298.150 k
press: 1.00000 atm
elementType: 16 16 16 15 8 6 6 6 6 6 6 6 6 6 6 6 6 1 1 1 1 1 1 1 1 1 1 1 1 1 1 1
symmnumber: 1
zpe: 631685.1 jmol-1
zpe.correction: 0.240596 hartree
zpe.thermalcorrener: 0.259417 hartree
zpe.thermalcorrenthalpy: 0.260361 hartree
zpe.thermalcorrgfe: 0.191186 hartree
zpe.sumelectzpe: -2075.653840 hartree
zpe.sumelectthermal: -2075.635019 hartree
zpe.sumelectthermalent: -2075.634075 hartree
zpe.sumelectthermalfe: -2075.703250 hartree
dipole: 1.8885 4.4396 2.2149
dipole: 5.3087
quadrupole: -127.6258 -128.8022 -131.1505
quadrupole: -4.5959 -8.9635 4.3745
quadrupole: 1.5670 0.3906 -1.9577 -4.5959 -8.9635 4.3745
hfenergy: -2075.894436 hartree
pointgroup: C01 [X(C12H15O1P1S3)]
dipole: -0.0306455 -1.6480926 -1.2826381 debye
polarizability: 206.0942503|-39.3858565|259.01633|22.5304896|35.5201419|179.3389944 unknown
InChI: InChI=1S/C9H8OPS2.C3H7S/c1-11(12)10-8-6-13-9-5-3-2-4-7(8)9;1-2-3-4/h2-6H,1H3;2-3H2,1H3
charge 0 multiplicity 1
32 atoms
S  -3.314767 0.363803 0.670699
S  1.965785 1.086905 2.29571
S  -2.370891 3.864698 0.692844
P  -2.253803 2.101561 -0.375885
O  -0.634287 1.447955 -0.771173
C  1.188269 -0.022884 -0.02735
C  0.335726 1.135197 0.199548
C  -2.785562 -1.118404 -0.420311
C  2.139605 -0.198901 1.022655
C  -2.59154 -2.362811 0.46497
C  -2.837513 2.15773 -2.139712
C  0.61406 1.832785 1.356296
C  1.179756 -0.930219 -1.118669
C  3.068408 -1.259313 1.010133
C  -2.180441 -3.587761 -0.385394
C  2.103449 -1.991506 -1.137173
C  3.040849 -2.157152 -0.078938
H  -1.839091 -0.84343 -0.91555
H  -3.572711 -1.27336 -1.177245
H  -1.815996 -2.150454 1.223556
H  -3.527808 -2.584821 1.012226
H  -2.755081 1.155688 -2.587771
H  -3.885538 2.493364 -2.14492
H  -2.20856 2.873008 -2.692077
H  0.122123 2.723243 1.7417
H  0.471611 -0.778608 -1.940342
H  3.794594 -1.386121 1.819561
H  -1.220835 -3.406044 -0.904215
H  -2.053453 -4.478459 0.255617
H  -2.946083 -3.825352 -1.147509
H  2.10991 -2.694466 -1.97722
H  3.754616 -2.987369 -0.11016
