program: Gaussian 09
title: 000087373
version: EM64L-G09RevD.01
frameworkgroup: C1[X(C15H38O2Si3)]
method: RPBEPBE
basis: SDD
operation: Freq
keyword: #p
keyword: freq=noraman
keyword: PBEPBE/SDD
title: #p freq=noraman PBEPBE/SDD
converged: YES YES NO NO
title: Mulliken charges:
elementType: Si Si Si O O C C C C C C C C C C C C C C C H H H H H H H H H H H H H H H H H H H H H H H H H H H H H H H H H H H H H H
charge: 1.673875 1.505132 1.501709 -1.000788 -1.017307 -0.877153 -0.325575 -0.364595 -1.059986 -0.379612 -0.369705 -1.036658 -1.044829 -1.051546 -1.039684 -1.035576 -1.039777 -0.353541 -0.356164 -0.697040 0.227359 0.224859 0.201964 0.205405 0.188072 0.186355 0.238024 0.234619 0.244688 0.189778 0.188344 0.189052 0.187820 0.226208 0.242154 0.242692 0.239852 0.230805 0.239456 0.231448 0.241090 0.244935 0.236660 0.232511 0.236887 0.240632 0.241170 0.228706 0.240680 0.230062 0.238998 0.186824 0.187736 0.194872 0.194343 0.209609 0.209522 0.214628
chargesum: 0.00000
title: Mulliken charges with hydrogens summed into heavy atoms:
elementType: Si Si Si O O C C C C C C C C C C C C C C C
charge: 1.673875 1.505132 1.501709 -1.000788 -1.017307 -0.424935 0.081795 0.009832 -0.342655 -0.001491 0.007167 -0.325604 -0.334715 -0.334073 -0.333626 -0.325068 -0.330036 0.021018 0.033051 -0.063281
polarizability: 2.66610225e+02 8.22189260e-01 2.30481307e+02 -6.36397072e+00 2.99776797e-02 2.19242277e+02
1716.lowfreq: -5.1467 -4.1300 -0.0009 0.0002 0.0010 4.1063 10.1221 13.4628 18.7317
frequency: 9.0380 12.5955 18.3817 26.1179 29.1428 31.8220 38.4120 41.3749 45.2986 50.8952 85.9531 86.9024 96.0652 109.3190 126.8493 131.3961 134.7467 139.2172 140.4220 141.9710 145.3014 149.9941 152.2417 152.8870 157.7973 163.7722 172.4011 186.8863 188.4070 200.7716 203.5478 226.1018 228.6228 237.9895 245.0419 266.2026 271.5298 284.4600 309.1613 338.1354 393.1212 409.3021 456.4544 475.7309 488.7234 605.0460 617.5939 691.1423 693.2866 695.4213 696.9422 702.9585 712.6445 721.2185 730.1837 731.2844 736.3223 737.4872 765.1543 809.5133 810.5693 812.6176 815.0006 823.8980 856.6477 867.6019 887.8115 903.7266 906.2911 907.1401 909.0260 910.0844 926.7498 929.8158 980.6007 987.1844 1016.4932 1030.5388 1034.1342 1044.9866 1061.5620 1063.0930 1077.1501 1080.4198 1114.9885 1185.2406 1188.4923 1217.7631 1231.7786 1253.4245 1273.5919 1278.1328 1282.7521 1289.7159 1293.4724 1294.3796 1294.9254 1296.1003 1296.6087 1303.1867 1305.9310 1307.7966 1313.6561 1339.5271 1349.6993 1353.2199 1388.6293 1428.0296 1435.4809 1438.4014 1441.7562 1442.9676 1444.3952 1445.9644 1446.6857 1447.9188 1448.3399 1450.8433 1451.4548 1452.4085 1459.6673 1460.1671 1461.0107 1463.4179 1465.6588 1470.4740 1476.3329 1477.6392 1483.8732 1488.7822 2948.1705 2948.5908 2951.7915 2957.5637 2963.1833 2967.2634 2970.7867 2972.1413 2979.3816 2979.9607 2981.0950 2981.1386 2981.6660 2983.0118 2984.3791 2987.6093 2988.6182 2999.1712 3011.3513 3022.6000 3034.4008 3043.6317 3067.0771 3069.3481 3081.1219 3081.9381 3083.5293 3083.8538 3086.3251 3087.2468 3087.4470 3088.0565 3089.7299 3089.7750 3091.0912 3093.6636 3094.2567 3095.2885
redmass: 2.9692 4.1194 3.6575 2.8002 3.6068 2.6868 2.9287 3.7450 3.7173 2.3381 2.0471 2.6209 2.6528 1.0172 1.0551 1.5934 1.0601 1.2355 2.1506 1.4196 1.2621 2.7430 1.1093 1.1356 2.1901 3.0144 2.3243 2.7298 2.6500 2.6581 2.7090 2.8384 1.1349 2.7395 3.3421 3.5453 3.9463 3.4166 3.7923 6.7421 4.7660 3.7042 3.6952 3.1243 4.4523 3.8787 3.7017 2.8423 2.8826 2.8579 2.8516 2.9381 1.1787 1.0639 3.2457 1.2094 1.1687 1.1692 1.1845 1.3888 1.3793 1.3716 1.3739 1.2277 1.3385 1.6392 1.8740 1.5112 1.5539 1.3386 1.5888 1.5964 1.5392 1.6343 5.2011 1.1935 3.6026 3.4131 8.9512 1.1235 3.2129 10.0799 2.3149 2.1653 2.2774 1.8068 1.3692 1.4679 1.3420 1.2974 1.3177 1.0346 1.1711 1.0730 1.2099 1.2068 1.1462 1.2036 1.1859 1.2123 1.1951 1.1977 1.3577 1.4647 1.6201 1.6740 1.2175 1.0780 1.0545 1.0543 1.0527 1.0544 1.0531 1.0523 1.0537 1.0493 1.0490 1.0487 1.0486 1.0484 1.0542 1.0601 1.0709 1.0561 1.0647 1.0776 1.0453 1.0774 1.0872 1.0904 1.0586 1.0587 1.0592 1.0589 1.0586 1.0586 1.0367 1.0578 1.0344 1.0343 1.0344 1.0348 1.0958 1.0343 1.0344 1.0344 1.0985 1.1007 1.1023 1.1034 1.1040 1.1037 1.1006 1.0993 1.0979 1.0978 1.0979 1.0979 1.0976 1.0981 1.0981 1.0983 1.0982 1.0983 1.0981 1.0983 1.0983 1.0983
irintensity: 0.0421 0.0091 0.3311 1.1838 0.3446 0.3631 1.1928 0.3817 1.1740 0.3154 0.5093 1.1115 0.0402 0.0287 0.0134 0.0239 0.0452 0.0539 0.0083 0.1210 0.0057 0.1923 0.0357 0.0698 0.0144 0.0351 0.1604 0.3929 0.2175 1.0602 0.1088 1.1021 0.0279 4.5793 4.3404 36.8292 0.2716 11.1298 29.8934 52.8205 36.9859 4.3056 8.0365 5.8522 6.9387 6.2133 2.5436 9.3248 11.6033 11.0976 8.5426 15.5383 14.7269 10.5829 56.2913 9.8311 0.0036 0.0256 0.0095 11.1289 23.6251 26.1706 18.9643 1.3373 92.8836 129.7059 1.2220 39.6962 44.6285 112.9742 200.4990 177.4331 86.3903 26.2131 5.9840 0.7028 4.0424 19.2167 677.4526 54.6980 62.2323 511.2588 5.5533 0.8272 24.2344 0.5834 36.9443 0.3083 1.1309 0.8236 1.6155 0.0467 2.2325 1.0422 46.2849 37.5450 25.1884 43.9883 34.7396 67.7442 43.4111 11.0645 0.4972 0.0811 0.0988 1.3803 11.1378 6.7445 0.0866 0.0988 0.8555 1.5915 1.8233 3.7435 1.2408 7.8918 14.2126 11.2406 2.7921 2.7875 21.0971 7.4511 0.5647 16.6687 6.3002 1.2748 10.7100 3.9085 3.0076 25.4365 0.5293 0.1726 0.2805 23.0573 11.7523 106.4196 36.7911 103.9185 13.9070 16.2597 11.0418 16.8074 0.1774 8.3970 11.0506 13.4010 0.0629 0.1251 0.0201 0.4492 27.7389 173.3014 95.8980 57.7862 13.7095 2.1594 7.5814 10.5008 59.2840 23.4283 30.0042 18.0661 12.5237 23.3628 23.1568 18.8701 20.9276 19.9433
temp: 298.150 k
press: 1.00000 atm
elementType: 14 14 14 8 8 6 6 6 6 6 6 6 6 6 6 6 6 6 6 6 1 1 1 1 1 1 1 1 1 1 1 1 1 1 1 1 1 1 1 1 1 1 1 1 1 1 1 1 1 1 1 1 1 1 1 1 1 1
symmnumber: 1
zpe: 1311297.3 jmol-1
zpe.correction: 0.499447 hartree
zpe.thermalcorrener: 0.533512 hartree
zpe.thermalcorrenthalpy: 0.534456 hartree
zpe.thermalcorrgfe: 0.427173 hartree
zpe.sumelectzpe: -1611.531361 hartree
zpe.sumelectthermal: -1611.497296 hartree
zpe.sumelectthermalent: -1611.496351 hartree
zpe.sumelectthermalfe: -1611.603635 hartree
dipole: -0.3078 -0.3314 -0.6007
dipole: 0.7519
quadrupole: -151.7249 -146.1745 -149.7479
quadrupole: 0.4319 3.0545 -0.4080
quadrupole: -2.5091 3.0412 -0.5321 0.4319 3.0545 -0.4080
hfenergy: -1612.0308075 hartree
pointgroup: C01 [X(C15H38O2Si3)]
dipole: 0.1156724 -0.1584625 0.2214255 debye
polarizability: 265.7072159|-3.5383788|230.7774456|-8.0679207|1.5411791|219.849148 unknown
InChI: InChI=1S/C15H38O2Si3/c1-9-10-11-12-13-14-15-20(8,16-18(2,3)4)17-19(5,6)7/h9-15H2,1-8H3
charge 0 multiplicity 1
58 atoms
Si 1.994509 -0.102951 -1.547329
Si 2.906767 2.226209 0.702034
Si 2.528839 -2.861327 0.367815
O  2.35224 1.258645 -0.597266
O  2.237654 -1.515341 -0.640381
C  0.157205 -0.002502 -2.046052
C  -0.823249 0.03989 -0.846825
C  -2.305059 0.151759 -1.27423
C  3.182065 -0.122924 -3.028098
C  -3.281931 0.225393 -0.078303
C  -4.763368 0.335882 -0.50455
C  2.71389 4.041973 0.159866
C  1.833872 1.855722 2.236716
C  4.737252 1.809231 1.047327
C  3.463887 -2.26888 1.923149
C  3.582316 -4.112321 -0.612792
C  0.847575 -3.623301 0.848382
C  -5.74123 0.44152 0.687624
C  -7.221742 0.550417 0.256499
C  -8.192252 0.673655 1.451097
H  0.021421 0.903785 -2.671478
H  -0.078903 -0.870674 -2.695263
H  -0.566007 0.90017 -0.19524
H  -0.689658 -0.872302 -0.229684
H  -2.56884 -0.71747 -1.912714
H  -2.434162 1.053691 -1.908923
H  3.071006 0.795557 -3.632163
H  2.990964 -0.994429 -3.679889
H  4.228029 -0.17871 -2.677134
H  -3.149756 -0.673579 0.559908
H  -3.017614 1.097804 0.555741
H  -5.033218 -0.545877 -1.123034
H  -4.889273 1.223739 -1.159539
H  3.055554 4.737172 0.94926
H  1.656488 4.270209 -0.065267
H  3.30577 4.239524 -0.75198
H  0.766211 2.042799 2.02009
H  2.126178 2.48902 3.09514
H  1.939429 0.797943 2.539919
H  5.144344 2.435688 1.863139
H  5.353738 1.979795 0.145951
H  4.847168 0.74998 1.343346
H  2.861954 -1.534866 2.489789
H  3.690988 -3.115711 2.597591
H  4.419872 -1.78805 1.646019
H  3.048875 -4.442191 -1.522745
H  4.538788 -3.655918 -0.926221
H  3.8122 -5.008423 -0.006534
H  0.291789 -3.944485 -0.051286
H  0.981064 -4.506154 1.501284
H  0.224597 -2.888575 1.390424
H  -5.474551 1.32604 1.303627
H  -5.616569 -0.443701 1.346325
H  -7.490312 -0.338519 -0.350321
H  -7.341772 1.428721 -0.410562
H  -8.114809 -0.206127 2.117902
H  -7.963358 1.571825 2.055566
H  -9.242868 0.751148 1.115174
