program: Gaussian 09
title: 000087803
version: EM64L-G09RevD.01
frameworkgroup: C1[X(C18H39PS)]
method: RPBEPBE
basis: SDD
operation: Freq
keyword: #p
keyword: freq=noraman
keyword: PBEPBE/SDD
title: #p freq=noraman PBEPBE/SDD
converged: YES YES NO NO
title: Mulliken charges:
elementType: S P C C C C C C C C C C C C C C C C C C H H H H H H H H H H H H H H H H H H H H H H H H H H H H H H H H H H H H H H H
charge: -0.329204 0.398816 -0.659402 -0.661246 -0.659628 -0.330057 -0.327656 -0.330409 -0.353018 -0.353931 -0.353342 -0.353839 -0.352743 -0.353865 -0.355909 -0.356463 -0.355828 -0.695217 -0.695021 -0.695216 0.265484 0.234934 0.265695 0.234930 0.266241 0.234575 0.196270 0.242679 0.195953 0.242745 0.195932 0.242759 0.184610 0.191124 0.184233 0.191479 0.184052 0.192238 0.186143 0.196930 0.185793 0.196974 0.185776 0.196990 0.192827 0.196152 0.192758 0.196214 0.192635 0.196503 0.212463 0.209321 0.215379 0.212437 0.209348 0.215418 0.212467 0.209226 0.215490
chargesum: 0.00000
title: Mulliken charges with hydrogens summed into heavy atoms:
elementType: S P C C C C C C C C C C C C C C C C C C
charge: -0.329204 0.398816 -0.158984 -0.160621 -0.158812 0.108893 0.111042 0.108282 0.022716 0.021780 0.022949 0.029234 0.030024 0.028901 0.033070 0.032509 0.033310 -0.058054 -0.057818 -0.058033
polarizability: 2.58656553e+02 -6.17372754e-02 2.57300710e+02 1.25997845e-01 -1.79737288e-01 2.11269634e+02
1716.lowfreq: -5.5301 -3.5564 -1.3255 0.0012 0.0018 0.0021 15.6014 17.2661 20.7750
frequency: 15.5263 16.9055 20.6162 31.7486 39.6252 43.1067 47.7726 49.2073 63.6195 72.3673 75.9619 77.2991 105.4036 107.3503 111.6503 117.2183 118.1605 134.2595 136.5030 138.1879 153.3081 180.0446 184.0060 184.8810 229.3741 232.7435 232.9570 240.1133 241.6676 264.4530 307.9712 308.8412 404.2678 415.9472 417.2740 418.8591 462.4010 462.7488 496.4624 678.0785 698.5768 700.0145 724.8182 725.7036 726.1274 736.2053 738.5082 739.5727 778.9974 780.1597 783.8422 860.5932 861.7687 868.7888 889.1596 889.6808 890.3704 962.1813 964.5821 969.9147 1000.9137 1007.1513 1007.4746 1021.3148 1025.6972 1026.0087 1054.4677 1058.3282 1067.1746 1069.4043 1072.1020 1076.5850 1078.8483 1079.8968 1086.2900 1113.5872 1114.0803 1114.4261 1188.7721 1189.8553 1193.1378 1208.5817 1209.6250 1210.8592 1236.5602 1238.0844 1241.7629 1257.1759 1258.7238 1261.0972 1279.8332 1281.4993 1282.9755 1286.1198 1288.1410 1290.6932 1297.1235 1300.3028 1302.2285 1313.0852 1315.5751 1317.2135 1346.9185 1349.6047 1350.0291 1352.7593 1355.2305 1355.8084 1388.5006 1389.1030 1391.1574 1416.5743 1423.2781 1424.7831 1462.6670 1463.5187 1464.2369 1464.6966 1465.1082 1465.9957 1473.0748 1473.1622 1474.3197 1477.2362 1477.4655 1477.8403 1481.2882 1481.6080 1482.5264 1487.8412 1488.5208 1489.0256 2952.6002 2952.9156 2953.0007 2956.9607 2957.4263 2957.4445 2966.3611 2966.5273 2966.6402 2970.5819 2970.7955 2971.3999 2972.1568 2972.4301 2972.7270 2984.0603 2985.2477 2987.4774 2990.6902 2991.2229 2991.2914 3004.4948 3004.9179 3004.9866 3024.8194 3025.2444 3025.7934 3039.2022 3039.7765 3040.4507 3064.0697 3064.9807 3066.0683 3068.9620 3069.2366 3069.3288 3071.1330 3071.5047 3071.7984
redmass: 3.8902 4.0053 4.0037 1.6121 2.1831 1.7951 2.4911 2.7715 3.3845 2.4086 3.1809 3.2501 1.8247 1.7950 1.9052 3.2577 3.5729 2.2124 2.3506 2.3375 3.8605 2.7854 2.6684 2.7320 1.1165 1.1156 1.1259 3.3897 3.3093 3.1169 4.5585 4.5377 3.2698 3.2693 3.0453 3.0698 3.7361 3.7154 6.3936 3.0398 2.4151 2.3848 1.0757 1.0793 1.0768 1.1907 1.2721 1.2935 1.2798 1.2942 1.2801 1.2769 1.2737 1.2975 1.9025 1.8946 1.8992 1.2379 1.2398 1.2786 3.0309 3.4554 3.4846 3.5259 3.5518 3.5763 1.1921 1.2315 2.6493 2.4470 2.5523 1.7182 2.1957 1.6178 2.1321 2.2874 2.3055 2.2918 1.6988 1.6901 1.6510 1.2991 1.2850 1.2807 1.3372 1.3338 1.3306 1.2927 1.2939 1.2902 1.1591 1.1496 1.1617 1.0586 1.0696 1.0561 1.1063 1.0963 1.0962 1.3393 1.3390 1.3368 1.4572 1.4540 1.4643 1.6456 1.6540 1.6516 1.2157 1.2156 1.2169 1.0818 1.0859 1.0858 1.0666 1.0675 1.0674 1.0749 1.0764 1.0748 1.0701 1.0714 1.0710 1.0438 1.0424 1.0430 1.0785 1.0786 1.0794 1.0878 1.0880 1.0896 1.0588 1.0589 1.0590 1.0589 1.0590 1.0591 1.0596 1.0596 1.0597 1.0601 1.0602 1.0595 1.0363 1.0366 1.0363 1.0602 1.0598 1.0597 1.0954 1.0961 1.0960 1.1005 1.1005 1.1006 1.1026 1.1025 1.1026 1.1039 1.1036 1.1036 1.1038 1.1032 1.1032 1.1007 1.1007 1.1007 1.0994 1.0994 1.0994
irintensity: 0.1774 0.1772 0.2434 0.1997 0.8623 0.5881 1.2730 1.4786 0.0873 0.2245 2.5196 2.7137 0.0729 0.0106 0.0856 2.1226 1.8256 0.1706 0.9744 1.0592 0.0308 0.4281 0.8825 0.9914 0.0033 0.0040 0.0038 0.5396 0.5713 0.1377 6.0289 6.0552 0.2561 0.7909 1.6562 1.6570 2.6797 2.5929 20.5150 4.7637 2.5140 2.2391 22.0891 15.9240 10.1544 3.8377 5.6486 6.6229 11.6301 11.6467 21.5697 1.7773 1.6828 3.4426 4.6987 5.6218 6.1391 4.3299 4.4737 9.3007 1.6443 2.4850 2.6167 0.0681 1.6323 1.8716 4.7366 4.1324 0.7047 2.2599 2.3781 3.4625 0.5596 7.7834 2.2068 16.9196 21.0143 21.0103 0.3375 0.1732 2.6906 20.1799 11.4382 15.6898 2.8487 3.0068 1.4733 0.8296 1.0161 0.6752 1.1829 1.4181 1.4129 0.9850 0.8335 0.8053 1.0027 5.1493 5.8574 1.3541 1.5001 1.3566 0.8334 1.0691 1.1392 1.5809 1.7002 1.9657 10.9531 11.1186 11.0548 2.3949 5.7729 5.3432 0.1336 0.1881 0.1531 0.2175 0.3150 0.2703 2.8072 1.6287 2.0644 11.8011 12.3078 12.2826 2.4110 3.0634 2.1504 21.9549 21.7958 22.2822 4.0215 1.9041 7.5953 3.8001 4.0136 4.1122 36.4554 17.6781 42.3161 86.2795 73.0103 54.4219 41.4384 47.5391 36.8108 18.3885 18.1094 41.1645 5.7127 5.9151 3.0824 1.0230 0.9334 0.5373 6.3454 6.8119 12.5410 43.9197 47.4191 78.9786 22.7182 21.5932 16.8216 97.7510 101.9191 94.1332 55.7881 57.4363 57.5156
temp: 298.150 k
press: 1.00000 atm
elementType: 16 15 6 6 6 6 6 6 6 6 6 6 6 6 6 6 6 6 6 6 1 1 1 1 1 1 1 1 1 1 1 1 1 1 1 1 1 1 1 1 1 1 1 1 1 1 1 1 1 1 1 1 1 1 1 1 1 1 1
symmnumber: 1
zpe: 1399402.5 jmol-1
zpe.correction: 0.533004 hartree
zpe.thermalcorrener: 0.562397 hartree
zpe.thermalcorrenthalpy: 0.563341 hartree
zpe.thermalcorrgfe: 0.466544 hartree
zpe.sumelectzpe: -1446.929606 hartree
zpe.sumelectthermal: -1446.900214 hartree
zpe.sumelectthermalent: -1446.899270 hartree
zpe.sumelectthermalfe: -1446.996067 hartree
dipole: -0.0264 0.0619 -5.0789
dipole: 5.0794
quadrupole: -141.1224 -141.0433 -154.3422
quadrupole: 0.0160 0.0159 0.1793
quadrupole: 4.3802 4.4593 -8.8396 0.0160 0.0159 0.1793
hfenergy: -1447.4626107 hartree
pointgroup: C01 [X(C18H39P1S1)]
dipole: -0.0195435 0.0087402 -1.9982571 debye
polarizability: 258.2695089|0.6159543|257.6863329|0.2730131|-0.1974194|211.2710544 unknown
InChI: InChI=1S/C18H39PS/c1-4-7-10-13-16-19(20,17-14-11-8-5-2)18-15-12-9-6-3/h4-18H2,1-3H3
charge 0 multiplicity 1
59 atoms
S  0.012794 -0.025379 2.213383
P  -0.003406 -0.021632 0.099814
C  1.678831 0.420434 -0.650851
C  -0.475571 -1.69738 -0.6476
C  -1.233141 1.220958 -0.630144
C  2.834464 -0.415918 -0.066041
C  -1.768617 -2.276832 -0.040636
C  -1.062104 2.642944 -0.05971
C  4.219474 0.09262 -0.530122
C  -2.064148 -3.711865 -0.537067
C  -2.192055 3.595782 -0.515815
C  5.385928 -0.735494 0.055056
C  -3.362152 -4.29195 0.068716
C  -2.01831 5.031491 0.029498
C  6.776849 -0.227083 -0.388036
C  -3.671319 -5.729698 -0.408074
C  -3.153981 5.988183 -0.400447
C  7.936589 -1.057169 0.203624
C  -4.971595 -6.297143 0.20119
C  -2.967817 7.42256 0.139909
H  1.836773 1.492913 -0.431631
H  1.599373 0.300827 -1.7495
H  0.376325 -2.374653 -0.45068
H  -0.562314 -1.560124 -1.743686
H  -2.239312 0.831264 -0.38752
H  -1.112623 1.203636 -1.731551
H  2.719499 -1.480051 -0.356446
H  2.770963 -0.380274 1.039876
H  -2.630372 -1.623081 -0.286221
H  -1.672706 -2.271799 1.063362
H  -0.083573 3.062674 -0.370065
H  -1.045036 2.580427 1.04664
H  4.276242 0.074367 -1.638997
H  4.337258 1.153976 -0.227211
H  -2.140528 -3.720098 -1.644857
H  -1.210743 -4.371888 -0.276076
H  -2.23316 3.627472 -1.625037
H  -3.16824 3.190576 -0.176994
H  5.272318 -1.797737 -0.24715
H  5.326023 -0.719498 1.162958
H  -4.216122 -3.631166 -0.189776
H  -3.285569 -4.281586 1.175621
H  -1.045955 5.441401 -0.315533
H  -1.966495 4.999052 1.137414
H  6.835814 -0.243311 -1.495768
H  6.889451 0.834373 -0.086221
H  -3.744647 -5.739723 -1.515046
H  -2.820038 -6.391086 -0.14671
H  -3.210486 6.013066 -1.508203
H  -4.124357 5.582039 -0.048688
H  7.916849 -1.032149 1.309555
H  7.865559 -2.116465 -0.108088
H  8.919698 -0.673171 -0.125588
H  -4.912354 -6.323022 1.305634
H  -5.84322 -5.672789 -0.072266
H  -5.169199 -7.326323 -0.150987
H  -2.936401 7.427862 1.245769
H  -2.020209 7.863119 -0.223726
H  -3.792998 8.086217 -0.177856
