program: Gaussian 09
title: 000087311
version: EM64L-G09RevD.01
frameworkgroup: C1[X(C10H15NO2S)]
method: RPBEPBE
basis: SDD
operation: Freq
keyword: #p
keyword: freq=noraman
keyword: PBEPBE/SDD
title: #p freq=noraman PBEPBE/SDD
converged: YES YES NO NO
title: Mulliken charges:
elementType: S O O N C C C C C C C C C C H H H H H H H H H H H H H H H
charge: 0.399873 -0.199145 -0.190434 -0.559112 -0.473925 -0.315172 -0.377186 -0.399159 -0.395780 -0.386659 -0.494729 -0.494031 0.235946 0.231933 0.290903 0.221283 0.204681 0.223589 0.209850 0.206681 0.194416 0.200337 0.207264 0.205082 0.194153 0.261643 0.266900 0.267311 0.263487
chargesum: 0.00000
title: Mulliken charges with hydrogens summed into heavy atoms:
elementType: S O O N C C C C C C C C C C
charge: 0.399873 -0.199145 -0.190434 -0.559112 -0.183022 0.110791 0.056254 0.001938 0.011821 0.012575 0.033814 0.036767 0.235946 0.231933
polarizability: 1.65999657e+02 -6.40293846e+00 1.24589318e+02 6.07925889e+00 4.29555381e+00 1.13206094e+02
1716.lowfreq: -26.7730 -13.6978 -9.4183 -0.0006 0.0000 0.0015 15.7588 25.3939 53.3235
frequency: -13.0496 24.0441 53.2573 64.6414 99.2286 111.4932 188.1432 209.3513 218.0904 246.1383 299.0558 333.3835 366.0334 414.0293 425.2186 483.2809 493.3158 537.8909 542.2255 569.3926 616.6403 639.1873 698.6275 782.6375 805.3740 820.4180 842.2990 877.5615 887.3181 912.5507 916.5124 979.2015 987.3705 1006.6716 1022.6074 1042.2915 1054.4154 1080.3100 1107.2662 1116.6041 1141.2265 1146.4947 1184.7997 1195.1176 1207.3119 1209.7919 1253.3653 1255.1281 1263.5373 1282.5747 1289.5059 1302.7920 1328.0709 1329.1019 1337.8683 1342.2585 1350.5079 1437.3096 1453.0068 1455.7503 1460.1967 1460.7904 1468.8835 1475.4819 1644.8920 1702.0620 2969.5881 2970.7640 2973.9131 2974.7559 2988.5810 3025.0893 3025.5204 3033.6350 3034.5694 3035.2942 3042.8222 3047.2415 3059.7867 3078.6303 3096.8376
redmass: 3.1348 6.1074 4.1653 1.8770 6.0937 3.2522 4.6986 1.9860 6.4453 7.5807 1.9808 10.1472 4.4376 2.3537 3.1660 1.6806 9.2344 3.4669 4.3548 2.4851 10.0938 6.4866 3.0931 1.4472 3.1381 1.5251 1.7054 2.1145 1.6555 7.9317 1.7832 4.9403 2.4654 2.2202 2.3087 1.9253 1.1665 1.3090 2.7304 1.8046 1.2591 7.1594 1.4728 1.4350 3.5610 1.2017 1.2761 1.2830 1.2804 1.8726 1.4845 1.2755 1.3760 1.3327 1.4652 1.4227 1.4340 1.0720 1.0901 1.0900 1.0872 1.0879 1.0836 1.0948 12.5129 12.5763 1.0647 1.0603 1.0646 1.0600 1.0611 1.0880 1.0594 1.0951 1.0979 1.0635 1.1012 1.1035 1.1012 1.1033 1.1017
irintensity: 0.1256 0.8307 2.0523 0.0682 11.4874 2.5179 1.6784 0.1691 0.8588 2.3248 0.0026 6.9979 4.1148 0.9980 0.8340 1.1703 0.2068 0.1691 1.4945 3.7563 14.4869 40.2504 9.6898 0.1327 3.2692 18.3017 2.3820 1.5235 11.1540 11.4177 0.8864 4.8093 23.4380 0.2674 15.3653 0.8723 0.0534 0.3895 0.3886 7.0015 10.9985 228.0698 8.1656 10.7166 151.9867 16.7065 8.8886 3.5890 1.1683 52.6222 0.9796 1.5477 11.0600 1.2402 0.9226 0.0914 2.0025 1.1493 25.9443 6.8440 4.6394 10.1357 21.7066 1.8243 535.9609 6.8831 33.5408 33.9097 21.3043 27.9518 14.1332 11.9944 13.5886 54.1007 70.3359 3.6757 21.2225 14.8645 78.1776 0.0234 8.7952
temp: 298.150 k
press: 1.00000 atm
elementType: 16 8 8 7 6 6 6 6 6 6 6 6 6 6 1 1 1 1 1 1 1 1 1 1 1 1 1 1 1
symmnumber: 1
zpe: 623307.8 jmol-1
zpe.correction: 0.237405 hartree
zpe.thermalcorrener: 0.250606 hartree
zpe.thermalcorrenthalpy: 0.251551 hartree
zpe.thermalcorrgfe: 0.196142 hartree
zpe.sumelectzpe: -992.260162 hartree
zpe.sumelectthermal: -992.246961 hartree
zpe.sumelectthermalent: -992.246017 hartree
zpe.sumelectthermalfe: -992.301425 hartree
dipole: 0.2134 0.7834 -2.5671
dipole: 2.6925
quadrupole: -71.7787 -104.4745 -92.2984
quadrupole: -1.2078 5.8737 -7.4366
quadrupole: 17.7385 -14.9573 -2.7812 -1.2078 5.8737 -7.4366
hfenergy: -992.4975673 hartree
pointgroup: C01 [X(C10H15N1O2S1)]
dipole: -0.1054505 -0.2322473 1.0281353 debye
polarizability: 166.0236487|0.0896133|125.3115694|9.0115222|2.2723446|112.4598513 unknown
InChI: InChI=1S/C10H15NO2S/c12-9-6-7-10(13)11(9)14-8-4-2-1-3-5-8/h8H,1-7H2
charge 0 multiplicity 1
29 atoms
S  0.116083 0.168188 -1.595428
O  1.443645 -2.459239 -0.436279
O  2.030648 2.202956 -0.067405
N  1.506405 -0.083536 -0.485819
C  -1.338696 -0.230654 -0.403875
C  -1.380947 0.736831 0.790569
C  -2.619037 -0.14866 -1.263761
C  -2.628451 0.451959 1.667993
C  -3.867026 -0.425892 -0.383227
C  -3.928029 0.529682 0.831522
C  3.21573 -1.176655 0.769985
C  3.410039 0.353418 0.884342
C  1.975135 -1.376543 -0.109907
C  2.266067 0.986351 0.07922
H  -1.169705 -1.271629 -0.073662
H  -1.414553 1.777079 0.412315
H  -0.459293 0.642819 1.395383
H  -2.570522 -0.873323 -2.098418
H  -2.702553 0.866309 -1.703855
H  -2.663118 1.174339 2.505692
H  -2.542247 -0.558822 2.117765
H  -3.83419 -1.475279 -0.02551
H  -4.779632 -0.326153 -1.001279
H  -4.804454 0.285654 1.462117
H  -4.068842 1.569755 0.471914
H  3.045267 -1.66888 1.742693
H  4.069165 -1.68979 0.2944
H  4.369136 0.702551 0.46477
H  3.358574 0.724364 1.922144
