program: Gaussian 09
title: 000087302
version: EM64L-G09RevD.01
frameworkgroup: C1[X(C5H9NOS)]
method: RPBEPBE
basis: SDD
operation: Freq
keyword: #p
keyword: freq=noraman
keyword: PBEPBE/SDD
title: #p freq=noraman PBEPBE/SDD
converged: YES YES NO NO
title: Mulliken charges:
elementType: S O N C C C C C H H H H H H H H H
charge: 0.163103 -0.416942 0.002169 -0.371115 -0.654057 -0.088991 -0.175134 -0.837662 0.232454 0.243845 0.273201 0.249476 0.260942 0.256974 0.257890 0.257270 0.346577
chargesum: 0.00000
title: Mulliken charges with hydrogens summed into heavy atoms:
elementType: S O N C C C C C
charge: 0.163103 -0.070365 0.002169 0.105184 -0.131380 0.171951 -0.175134 -0.065527
polarizability: 1.09404366e+02 -9.50156521e+00 6.76513731e+01 -8.35476919e-01 3.37584250e+00 5.65856152e+01
1716.lowfreq: -16.3617 -5.2126 -0.6794 -0.0015 -0.0012 0.0005 30.9133 61.4204 86.8279
frequency: 30.8661 61.2113 86.8140 111.4231 149.6468 157.9334 219.0480 268.5218 293.6010 344.6447 413.5591 551.5617 566.6484 662.7795 704.9516 775.7996 850.5554 940.3415 967.7301 973.9393 1005.5529 1043.7079 1067.8913 1119.9887 1232.1990 1239.2231 1280.4887 1298.8519 1337.7591 1351.7574 1365.7133 1449.5425 1455.9933 1461.2746 1467.0401 2187.9041 2992.6296 3002.2825 3008.4739 3042.8295 3058.0200 3088.5317 3115.3144 3132.3536 3545.9343
redmass: 3.8882 3.6009 4.3311 2.3203 1.1883 3.9066 5.5326 5.1449 3.2671 1.2631 3.8478 5.0055 5.3173 6.7918 5.8792 1.3571 2.7119 2.2597 1.3280 1.4030 1.8394 4.0611 2.3448 1.2026 1.1801 1.3438 1.2641 1.1596 1.2658 1.1817 1.2307 1.0532 1.0724 1.0601 1.0919 12.5730 1.0611 1.0302 1.0560 1.0893 1.0961 1.1073 1.1059 1.1024 1.0664
irintensity: 1.0335 4.2126 3.2268 1.6265 0.4131 5.1828 3.3633 2.1336 33.5751 123.2794 33.7028 22.6450 5.6998 1.9537 3.2775 1.7452 42.8119 8.6415 18.9993 22.4321 31.5946 20.4519 10.6940 20.6991 9.1269 10.6203 4.6914 3.2600 8.1162 3.3045 24.0297 16.7475 11.4240 5.4554 11.3624 1.0560 7.9122 42.1672 20.1375 1.1976 10.4475 33.0080 21.0142 10.5089 12.0177
temp: 298.150 k
press: 1.00000 atm
elementType: 16 8 7 6 6 6 6 6 1 1 1 1 1 1 1 1 1
symmnumber: 1
zpe: 349805.0 jmol-1
zpe.correction: 0.133234 hartree
zpe.thermalcorrener: 0.143693 hartree
zpe.thermalcorrenthalpy: 0.144637 hartree
zpe.thermalcorrgfe: 0.095803 hartree
zpe.sumelectzpe: -723.290265 hartree
zpe.sumelectthermal: -723.279805 hartree
zpe.sumelectthermalent: -723.278861 hartree
zpe.sumelectthermalfe: -723.327695 hartree
dipole: -3.3301 1.6779 0.3651
dipole: 3.7467
quadrupole: -69.5518 -62.2447 -51.9024
quadrupole: 0.1734 -2.5748 -1.6373
quadrupole: -8.3188 -1.0117 9.3306 0.1734 -2.5748 -1.6373
hfenergy: -723.4234984 hartree
pointgroup: C01[X(C5H9N1O1S1)]
dipole: 1.3402642 0.5931586 -0.157401 debye
dipolederiv: -0.2411427 -0.0276971 0.013742 -0.0059708 -0.0399778 -0.07579 0.0045192 -0.0822606 -0.1504593 -0.7404115 0.0828232 0.001344 0.0757916 -0.5878195 -0.2161056 -0.0162317 -0.274187 -0.2534203 -0.2710455 -0.0047042 -0.028829 -0.0595847 -0.1945541 -0.0111692 0.0372662 0.0140929 -0.2056615 -0.0831314 0.006669 0.0246007 0.1173108 -0.0573713 0.008183 -0.0981802 0.0575906 0.0991538 0.1971082 -0.1393509 0.0675079 -0.0744428 0.0538074 0.0201765 0.0680282 0.0319725 0.1563391 0.5308957 -0.0511195 0.0108569 -0.0844348 0.6511099 0.1782056 0.0517537 0.2048915 0.4876956 -0.0872356 0.0050857 -0.0264846 0.1394024 -0.1287132 -0.0619568 -0.0472389 -0.0554469 -0.0928058 0.0878794 0.11575 -0.0594293 0.1080137 0.0493386 0.0189797 -0.0571384 0.0235762 0.0690259 0.0639911 0.0256359 0.0240784 -0.0139348 0.0804346 0.0202772 0.0427069 0.032069 -0.1099309 0.0716609 0.0110175 -0.0095055 -0.0550028 -0.0633325 -0.077381 -0.0127661 -0.0824901 0.0507678 0.0296452 0.021554 -0.0294722 0.0112654 -0.1002096 -0.0381275 -0.0439063 -0.0473836 0.0463753 -0.023922 0.0300086 -0.0184221 0.0392197 0.0494477 0.0524069 -0.0272391 0.0598081 -0.1518307 0.0726408 -0.0290325 0.0197913 -0.0261117 0.038958 0.022967 -0.0018801 -0.0042023 -0.0508127 -0.1017707 0.0525471 -0.0391476 0.0477502 0.0726772 0.0371447 -0.0386865 0.0356035 0.1092071 0.0416852 -0.0134494 0.038316 -0.0879377 -0.1327332 -0.0766827 0.0434202 -0.0637797 0.0535045 0.0407314 -0.0455121 0.0058652 -0.0904051 0.0583185 0.0547118 0.0668497 0.0461896 -0.1405697 0.4124215 -0.0402254 0.0051879 -0.0409286 0.2506192 0.1441606 0.0287232 0.1039564 0.0834219 unknown
polarizability: 110.2213581|7.4046449|66.7094181|-1.2638308|-3.526158|56.710578 unknown
InChI: InChI=1S/C5H9NOS/c1-8-3-2-5(7)4-6/h5,7H,2-3H2,1H3
charge 0 multiplicity 1
17 atoms
S  2.769132 -0.880878 0.354157
O  -1.181787 1.697057 0.399604
N  -3.508834 -0.877476 0.100694
C  0.013649 -0.49285 0.076416
C  1.343847 0.181821 -0.295839
C  -1.192615 0.405204 -0.306734
C  -2.478123 -0.308238 -0.092416
C  4.20088 0.221909 -0.172385
H  -0.019647 -0.70198 1.163876
H  -0.078687 -1.46485 -0.444043
H  1.414589 1.184566 0.15871
H  1.448363 0.272855 -1.392134
H  -1.124827 0.692225 -1.371372
H  5.122401 -0.281768 0.157943
H  4.124582 1.207515 0.314125
H  4.21656 0.335014 -1.268194
H  -1.291284 1.536073 1.37279
