program: Gaussian 09
title: 000087747
version: EM64L-G09RevD.01
frameworkgroup: C1[X(C20H18Si)]
method: RPBEPBE
basis: SDD
operation: Freq
keyword: #p
keyword: freq=noraman
keyword: PBEPBE/SDD
title: #p freq=noraman PBEPBE/SDD
converged: YES YES NO NO
title: Mulliken charges:
elementType: Si C C C C C C C C C C C C C C C C C C C C H H H H H H H H H H H H H H H H H H
charge: 1.389193 -0.203128 -0.178090 -0.183078 -0.451374 -0.305659 -0.311045 -0.311396 -0.338337 -0.319517 -0.312913 -0.233178 -0.236058 -0.233678 -0.250624 -0.243475 -0.240327 -0.524880 -0.233225 -0.234366 -0.235457 0.210713 0.251466 0.252319 0.243128 0.249833 0.235935 0.249064 0.227433 0.226821 0.226424 0.228750 0.227113 0.228240 0.213285 0.235179 0.228626 0.228235 0.228050
chargesum: 0.00000
title: Mulliken charges with hydrogens summed into heavy atoms:
elementType: Si C C C C C C C C C C C C C C C C C C C C
charge: 1.389193 -0.203128 -0.178090 -0.183078 -0.240661 -0.054193 -0.058727 -0.068269 -0.088505 -0.083582 -0.063849 -0.005745 -0.009237 -0.007254 -0.021874 -0.016362 -0.012087 -0.076417 -0.004598 -0.006130 -0.007407
polarizability: 2.56559498e+02 -1.75496888e+00 2.43158258e+02 -3.99840499e+00 -7.30415715e+00 1.90397303e+02
1716.lowfreq: -5.2575 -0.0016 -0.0015 -0.0013 2.6178 11.5080 16.2604 29.8542 36.3187
frequency: 15.8012 29.7567 36.1337 44.7609 51.6338 58.2485 71.6065 92.7373 127.1527 170.2765 188.9401 199.0399 222.4637 236.9844 246.4775 283.5176 357.9945 390.9614 392.5064 395.9600 422.7985 455.1089 471.7514 480.5434 522.0765 577.9929 614.4097 616.0035 616.0732 643.1486 688.6124 697.2990 700.6265 707.0601 708.2372 709.7677 749.8659 751.9367 752.9685 861.3464 862.5779 867.6590 926.6366 929.6268 931.9921 977.7413 981.1743 982.6353 986.6953 987.4505 987.7326 987.9149 999.0887 999.2953 1000.0550 1008.8401 1016.3036 1022.2614 1023.3351 1024.1082 1074.0934 1075.2442 1077.0095 1097.1853 1101.1275 1102.2864 1172.9724 1173.1924 1173.3902 1196.9164 1197.2121 1199.7599 1265.5862 1309.6203 1311.8070 1314.5538 1363.9852 1365.0654 1365.8738 1411.9689 1418.2006 1419.6446 1420.7801 1469.5860 1470.9941 1471.1694 1576.1158 1576.8700 1577.6796 1596.5083 1596.7260 1597.4382 1605.1355 3060.3569 3077.9366 3107.4879 3111.4425 3113.6115 3115.7005 3117.8495 3118.5897 3128.7670 3129.1545 3130.3114 3140.9073 3141.1511 3141.6614 3158.2518 3158.4011 3159.0045 3170.6281
redmass: 3.7286 3.7967 3.9243 5.0580 4.9751 4.7840 3.4369 3.7008 2.5046 4.5342 4.1249 3.6155 5.7602 4.6535 4.8265 4.3633 4.3791 2.7696 2.7772 2.8094 4.2005 4.7218 3.0796 3.6540 5.3861 2.1892 6.3811 6.4274 6.4063 5.4819 6.2705 6.2611 5.5409 1.7409 1.8074 1.8660 1.7251 1.7911 1.8734 1.2473 1.2463 1.2439 1.3583 1.3516 1.3471 1.3692 1.4111 1.4171 1.4737 6.0193 5.7218 4.6944 1.3111 1.3115 1.3085 1.2456 1.0932 3.1889 2.9822 2.8146 1.7213 1.7019 1.7049 2.5884 2.7722 2.8247 1.0563 1.0563 1.0568 1.1285 1.1284 1.1298 1.2995 1.4535 1.4312 1.4190 4.6750 4.9394 5.2254 1.2752 2.0991 2.0950 2.1164 2.0322 2.0181 2.0227 5.4878 5.5291 5.5901 5.7985 5.7838 5.7847 3.9347 1.0676 1.0812 1.0873 1.0868 1.0855 1.0875 1.0857 1.0862 1.0912 1.0910 1.0913 1.0957 1.0958 1.0959 1.1015 1.1015 1.1015 1.1144
irintensity: 0.0249 0.0104 0.0052 0.0338 0.0204 0.1710 0.0222 0.0806 0.1560 1.4966 1.3001 0.9030 0.7138 1.0097 0.9517 2.9382 4.6669 0.2156 0.0262 0.1026 4.7621 10.0555 10.2391 24.1642 89.7480 103.7747 0.6046 0.8022 1.3858 23.3462 25.8628 31.4167 18.3941 97.1095 71.7367 46.8720 9.5655 20.4611 25.4632 0.2866 0.1032 0.1366 0.0513 0.2335 0.2125 35.8643 0.2640 2.9262 2.3218 2.0850 4.1377 0.4218 0.0333 0.0710 0.1321 9.7597 24.7381 0.7158 4.3613 2.2379 3.0634 1.5843 1.0760 6.9902 44.2323 46.5481 0.2236 0.3106 0.3310 7.2410 6.2836 1.0629 2.4915 6.3294 4.4004 3.6292 1.0537 1.9570 2.7691 11.3873 17.2454 14.3378 20.1138 2.9666 9.8314 9.9090 0.0683 0.5382 0.8814 0.0189 0.0886 0.2533 2.0827 13.0228 19.1517 8.6058 6.3028 2.2188 2.0521 0.2520 0.4811 5.8874 5.5433 6.8324 36.8980 39.5906 42.8326 54.8190 47.3774 14.9665 26.4582
temp: 298.150 k
press: 1.00000 atm
elementType: 14 6 6 6 6 6 6 6 6 6 6 6 6 6 6 6 6 6 6 6 6 1 1 1 1 1 1 1 1 1 1 1 1 1 1 1 1 1 1
symmnumber: 1
zpe: 815198.9 jmol-1
zpe.correction: 0.310493 hartree
zpe.thermalcorrener: 0.329955 hartree
zpe.thermalcorrenthalpy: 0.330899 hartree
zpe.thermalcorrgfe: 0.259488 hartree
zpe.sumelectzpe: -1060.858190 hartree
zpe.sumelectthermal: -1060.838728 hartree
zpe.sumelectthermalent: -1060.837784 hartree
zpe.sumelectthermalfe: -1060.909196 hartree
dipole: -0.0256 -0.1112 -0.1985
dipole: 0.2290
quadrupole: -118.5844 -121.9854 -125.7810
quadrupole: -0.3869 0.4051 -0.6607
quadrupole: 3.5325 0.1315 -3.6640 -0.3869 0.4051 -0.6607
hfenergy: -1061.1686832 hartree
pointgroup: C01 [X(C20H18Si1)]
dipole: 0.019392 -0.0342914 -0.0810114 debye
polarizability: 251.6983899|6.2861413|248.7480053|-0.7878458|-5.5928026|189.6686627 unknown
InChI: InChI=1S/C20H18Si/c1-2-21(18-12-6-3-7-13-18,19-14-8-4-9-15-19)20-16-10-5-11-17-20/h2-17H,1H2
charge 0 multiplicity 1
39 atoms
Si 0.055562 -0.029085 0.706354
C  -0.676599 -1.624163 -0.053146
C  -1.049198 1.478098 0.282774
C  1.815508 0.287075 0.019597
C  0.162021 -0.201255 2.597878
C  -0.036042 -2.290788 -1.133037
C  -2.276429 1.343835 -0.421258
C  2.953814 -0.290352 0.646999
C  -1.895548 -2.168565 0.442422
C  -0.651708 2.782295 0.692821
C  2.01911 1.070194 -1.150276
C  -0.592724 -3.460252 -1.701409
C  -3.082348 2.471843 -0.703511
C  4.252886 -0.093255 0.124723
C  -2.455327 -3.337507 -0.121572
C  -1.454259 3.911768 0.415808
C  3.316144 1.269682 -1.676964
C  0.069367 -1.365339 3.295702
C  -1.804316 -3.9863 -1.197029
C  -2.674936 3.75845 -0.283025
C  4.43688 0.687228 -1.040442
H  0.32237 0.730197 3.166456
H  0.906963 -1.895959 -1.53061
H  -2.604478 0.353333 -0.759248
H  2.824653 -0.891615 1.555948
H  -2.409833 -1.67945 1.2797
H  0.299605 2.923494 1.222728
H  1.160248 1.537163 -1.648614
H  -0.081539 -3.958822 -2.533076
H  -4.023766 2.345529 -1.250723
H  5.117238 -0.544604 0.625579
H  -3.393949 -3.740367 0.276272
H  -1.128369 4.90665 0.740788
H  3.451204 1.878554 -2.578407
H  0.149434 -1.395343 4.39126
H  -0.096722 -2.32817 2.795117
H  -2.23629 -4.893227 -1.635828
H  -3.298999 4.633119 -0.500055
H  5.443371 0.84291 -1.445995
