program: Gaussian 09
title: 000087303
version: EM64L-G09RevD.01
frameworkgroup: C1[X(C10H10O3)]
method: RPBEPBE
basis: SDD
operation: Freq
keyword: #pfreq=noraman
keyword: PBEPBE/SDD
title: #p freq=noraman PBEPBE/SDD
converged: NO YES NO NO
title: Mulliken charges:
elementType: O O O C C C C C C C C C C H H H H H H H H H H
charge: -0.306415 -0.196850 -0.428733 0.190484 0.048324 0.203441 0.058129 -0.689544 -0.689566 -0.384417 0.167888 -0.203252 -0.325071 0.235962 0.231600 0.241130 0.241130 0.231600 0.235962 0.267805 0.234611 0.256268 0.379514
chargesum: 0.00000
title: Mulliken charges with hydrogens summed into heavy atoms:
elementType: O O O C C C C C C C C C C
charge: -0.306415 -0.196850 -0.049220 0.190484 0.048324 0.203441 0.058129 0.019149 0.019125 -0.116611 0.167888 0.031360 -0.068803
polarizability: 1.58657153e+02 -1.15837180e+00 1.26971684e+02 7.47858103e-03 5.39862918e-03 6.58084831e+01
1716.lowfreq: 0.0003 0.0005 0.0007 8.4681 11.0248 13.1437 59.7765 105.4667 176.6266
frequency: 59.7739 105.4650 176.6260 184.1116 202.7850 217.9784 232.7566 278.3636 278.4639 295.8472 350.6078 400.6171 407.5546 472.6991 504.5622 537.3540 547.7713 564.8156 590.3040 650.1621 682.8940 743.9488 765.7614 801.1806 819.3421 874.2085 904.2033 940.9656 950.7681 970.6462 1004.1849 1007.7130 1041.6248 1114.7097 1157.3797 1174.4401 1195.4800 1207.1246 1225.3670 1275.9886 1311.5864 1377.2409 1392.2234 1419.5349 1436.2017 1453.6199 1460.8446 1470.6097 1481.3419 1494.6970 1611.0538 1617.8293 1632.2269 2994.7554 2996.7062 3098.5861 3100.9042 3103.2806 3104.6989 3147.3533 3165.6134 3178.0687 3553.5756
redmass: 3.8844 6.2488 3.3473 3.9624 1.0813 3.7473 1.2665 2.5970 5.2387 3.1286 4.0948 1.9811 1.5932 5.6465 4.6969 5.9929 4.0459 5.7813 3.9661 9.5095 5.6022 2.4607 4.7136 1.8802 5.7699 5.2529 1.3963 1.4317 2.5554 1.3226 1.3032 4.0299 2.0574 2.0508 1.4057 1.1281 4.4611 4.8659 2.6325 3.3950 1.7969 1.2044 1.2004 5.4861 2.9112 1.0483 1.0466 1.0691 1.0945 3.4005 8.3072 7.7968 11.3236 1.0344 1.0349 1.1004 1.1016 1.0999 1.1009 1.0869 1.0925 1.0992 1.0659
irintensity: 2.9634 0.2245 1.1176 0.5397 0.3485 0.0666 4.3384 4.7886 2.7695 0.6547 14.6546 101.7761 59.0420 1.8182 0.6313 16.1126 1.2515 2.2593 6.3327 9.4599 3.6746 41.3820 7.0972 35.6935 14.8327 74.4876 0.1192 1.5820 0.1850 0.9261 0.0272 29.0098 36.2695 84.6956 157.1577 11.3444 10.9012 66.0470 21.9896 75.7058 12.8679 21.9694 21.4566 53.9863 75.2335 10.7714 0.0347 6.8476 8.6664 80.8386 3.1534 130.6286 240.9611 13.1919 15.6424 3.0068 10.1637 18.2350 28.5886 5.4316 2.8037 13.1288 61.9355
temp: 298.150 k
press: 1.00000 atm
elementType: 8 8 8 6 6 6 6 6 6 6 6 6 6 1 1 1 1 1 1 1 1 1 1
symmnumber: 1
zpe: 463667.2 jmol-1
zpe.correction: 0.176602 hartree
zpe.thermalcorrener: 0.188388 hartree
zpe.thermalcorrenthalpy: 0.189332 hartree
zpe.thermalcorrgfe: 0.139524 hartree
zpe.sumelectzpe: -611.791521 hartree
zpe.sumelectthermal: -611.779735 hartree
zpe.sumelectthermalent: -611.778790 hartree
zpe.sumelectthermalfe: -611.828599 hartree
dipole: 0.0852 -1.7768 -0.0002
dipole: 1.7788
quadrupole: -72.8991 -77.7516 -76.0025
quadrupole: -12.5014 -0.0007 -0.0013
quadrupole: 2.6520 -2.2005 -0.4514 -12.5014 -0.0007 -0.0013
hfenergy: -611.968123 hartree
pointgroup: C01 [X(C10H10O3)]
dipole: 0.0316708 0.6991202 0.0000602 debye
dipolederiv: -1.2740416 -0.409448 0.0000719 -0.2513413 -0.5534449 -0.0000082 0.0000919 0.0000039 -0.3203593 -0.851564 0.2987292 0.0000304 0.4345798 -0.7953297 0.0000026 0.0001901 -0.0001464 -0.3088471 -0.1472367 0.2151515 0.0000152 0.3376882 -1.3518582 -0.0001038 0.0000267 -0.0000698 -0.403308 0.7264096 -0.0777191 -0.0000241 -0.373067 -0.1857106 0.000035 0.0000217 0.0000548 0.3593735 1.405996 -0.3991044 -0.0001216 -0.1599229 0.9222131 -0.0000039 -0.0002396 0.0001116 0.0662245 -0.8980737 0.3139502 0.0001021 -0.1087416 -0.1225864 0.0000165 0.0000643 -0.0000264 0.0044794 0.845299 0.783706 -0.0000289 0.345984 0.2066484 -0.0000525 -0.0001268 -0.0000576 0.027413 -0.0284765 0.0091626 0.0274434 0.0197752 0.0801597 0.0415131 0.0021011 -0.0517867 -0.065249 -0.0284648 0.0092038 -0.0274622 0.0197861 0.0801824 -0.0415201 -0.0021597 0.0517593 -0.0652443 0.1582319 -0.2044328 -0.0000328 0.1814482 -0.016479 -0.0000039 -0.0000024 0.0000091 -0.1348613 -0.2264379 -0.5487851 -0.0000226 -0.3999869 1.2635977 0.0001269 -0.0000025 0.000122 0.0648648 -0.0555873 0.2235144 0.0000147 0.0877849 -0.0605223 0.000011 -0.0000061 0.0000096 -0.1712853 0.0994381 -0.103811 -0.0000217 0.0720356 0.0011243 0.0000061 -0.00001 0.0000208 -0.1460025 0.0320723 -0.0113811 -0.1157835 -0.0273287 0.0867128 -0.0204046 -0.0816742 -0.0203325 -0.0599442 0.0571185 -0.0666556 0.0255854 -0.1106571 -0.0990942 0.0144835 0.0207562 -0.0226895 0.0696317 -0.0284659 0.0474147 0.0206089 0.1094018 0.0304863 -0.0002454 0.0092916 0.0370614 0.0973253 -0.028449 0.0474086 -0.0205817 0.1094172 0.030456 0.0002284 -0.0092463 -0.0370658 0.0973387 0.0570695 -0.0666833 -0.0255803 -0.1107057 -0.0990899 -0.0144389 -0.0207333 0.0227413 0.0696476 0.0321402 -0.0113507 0.1157572 -0.0273171 0.0867317 0.0203765 0.0816392 0.0203172 -0.060022 0.0893488 0.047606 0.0000068 -0.0020093 -0.0250991 -0.0000147 -0.0000018 -0.0000118 0.1681976 -0.0382695 -0.0988801 0.0000061 -0.1004784 0.003397 -0.0000093 0.0000082 -0.0000145 0.1641487 -0.0390648 0.0532819 0.0000175 0.0489428 0.0884387 -0.0000092 0.0000148 -0.0000149 0.1658758 0.1410078 -0.0508775 -0.0000002 -0.0952878 0.4290661 0.0000147 -0.0000029 0.0000047 0.3806021 unknown
polarizability: 158.6508433|1.2416564|126.9779935|-0.0074927|0.0053789|65.8084831 unknown
InChI: InChI=1S/C10H10O3/c1-10(2)9(12)6-4-3-5-7(11)8(6)13-10/h3-5,11H,1-2H3
charge 0 multiplicity 1
23 atoms
O  0.611163 1.358334 -0.00005
O  2.064759 -1.996877 -0.000511
O  -2.157321 2.289661 0.000226
C  1.86256 0.486461 -0.000277
C  1.318247 -0.981161 -0.000154
C  -0.151284 -0.889687 -0.000131
C  -0.483871 0.482018 0.000002
C  2.644788 0.788905 -1.286418
C  2.6453 0.788936 1.285525
C  -1.167966 -1.876927 -0.000192
C  -1.822626 0.93085 0.000108
C  -2.507941 -1.438721 -0.000061
C  -2.833408 -0.051887 0.000083
H  2.012554 0.641939 -2.178507
H  3.013113 1.828941 -1.278203
H  3.505699 0.100506 -1.352072
H  3.506118 0.100394 1.350958
H  3.013809 1.828903 1.277048
H  2.013368 0.642189 2.177865
H  -0.905556 -2.938786 -0.000287
H  -3.32336 -2.16897 -0.000072
H  -3.876783 0.279035 0.000173
H  -1.332163 2.840145 0.000246
