program: Gaussian 09
title: 000087283
version: EM64L-G09RevD.01
frameworkgroup: C1[X(C10H9N3)]
method: RPBEPBE
basis: SDD
operation: Freq
keyword: #pfreq=noraman
keyword: PBEPBE/SDD
title: #p freq=noraman PBEPBE/SDD
converged: YES YES NO NO
title: Mulliken charges:
elementType: N N N C C C C C C C C C C H H H H H H H H H
charge: -0.240555 -0.070253 -0.005698 0.017387 0.476224 0.333941 -0.197763 -0.479093 -0.596940 -0.349793 -0.223510 -0.776057 -0.130230 0.253166 0.263170 0.277088 0.265897 0.244474 0.231319 0.213001 0.246252 0.247973
chargesum: 0.00000
title: Mulliken charges with hydrogens summed into heavy atoms:
elementType: N N N C C C C C C C C C C
charge: -0.240555 -0.070253 -0.005698 0.017387 0.476224 0.333941 0.055404 -0.215923 -0.053956 -0.105319 0.007809 -0.068830 -0.130230
polarizability: 1.57884072e+02 6.50813365e+00 1.40616388e+02 4.79631855e+00 -1.07382058e-01 6.90188582e+01
1716.lowfreq: -7.6776 -0.0006 -0.0004 0.0004 6.1711 10.8452 46.9685 65.6758 103.3788
frequency: 46.9076 65.6735 103.3597 140.3261 193.3195 205.3049 250.7028 277.2182 310.4730 353.9438 443.6470 492.3298 508.1351 512.4900 571.6818 593.8947 640.9998 668.2246 744.8710 749.7464 770.2605 851.6067 860.0261 872.3418 908.6781 911.1079 935.3446 945.0916 1008.7053 1049.2443 1080.2314 1122.2739 1140.9779 1172.2197 1198.6302 1257.4742 1262.7664 1297.4159 1312.0210 1323.0709 1378.2074 1403.2476 1435.7567 1441.0142 1453.1751 1464.8046 1502.1354 1522.4893 1557.0958 1627.4624 2196.5990 2967.0902 2989.1088 3054.5158 3070.0616 3099.5060 3147.6383 3171.5537 3194.2162 3214.3517
redmass: 5.6364 6.6005 1.0462 4.7806 3.2125 3.7493 3.4483 2.9606 6.3921 3.2883 7.4331 4.5440 5.3777 3.4352 3.9317 4.4011 4.1355 5.6962 3.0550 2.2190 3.2751 4.9719 1.4183 1.3174 3.2412 2.6089 2.8014 1.3145 2.2389 1.5272 1.7690 4.4387 1.7580 1.3758 1.4639 1.7702 2.2202 2.2584 1.7611 3.2469 2.3946 1.2666 1.1641 2.1003 1.0443 1.4901 3.0291 6.1687 6.0095 6.4155 12.4285 1.0665 1.0364 1.0919 1.0967 1.1007 1.0902 1.0896 1.1004 1.0981
irintensity: 6.2164 3.4868 1.0348 6.6429 1.8300 2.5510 6.0584 0.1383 0.2367 0.6066 0.6951 0.1938 2.2256 1.3785 2.6112 1.0719 1.3998 0.2771 39.6630 29.1106 27.8203 1.2145 26.9069 2.8272 6.7785 1.3013 3.5383 0.3779 0.2668 9.0427 5.9799 15.3134 21.0165 15.7253 0.7397 3.5426 9.4123 28.3124 6.2618 34.8776 2.9545 23.7468 21.7389 7.3648 13.8692 4.5769 16.1313 1.3850 13.1777 1.8062 5.2129 16.4314 19.6600 0.5932 11.7228 19.7779 9.6396 3.6640 6.4711 5.6563
temp: 298.150 k
press: 1.00000 atm
elementType: 7 7 7 6 6 6 6 6 6 6 6 6 6 1 1 1 1 1 1 1 1 1
symmnumber: 1
zpe: 442874.1 jmol-1
zpe.correction: 0.168682 hartree
zpe.thermalcorrener: 0.179855 hartree
zpe.thermalcorrenthalpy: 0.180799 hartree
zpe.thermalcorrgfe: 0.131040 hartree
zpe.sumelectzpe: -549.792096 hartree
zpe.sumelectthermal: -549.780922 hartree
zpe.sumelectthermalent: -549.779978 hartree
zpe.sumelectthermalfe: -549.829737 hartree
dipole: 0.9941 0.8274 -2.9717
dipole: 3.2409
quadrupole: -76.6350 -74.5903 -79.6596
quadrupole: 12.8756 11.3846 -2.3904
quadrupole: 0.3267 2.3713 -2.6980 12.8756 11.3846 -2.3904
hfenergy: -549.9607776 hartree
pointgroup: C01 [X(C10H9N3)]
dipole: -0.492719 0.4004977 1.1057381 debye
dipolederiv: 0.0738043 -0.3890788 -0.0322351 -0.0275215 -0.44232 0.001644 0.0041607 -0.1024086 0.0512806 -0.6022984 -0.0649196 -0.0358308 0.2485561 -0.538406 0.0393895 -0.0840645 -0.0251869 -0.2515665 -0.2656556 -0.0011689 -0.0059376 -0.0776334 -0.22048 -0.0041875 0.1308226 0.0007838 -0.1978561 -0.1904332 0.0346933 -0.0277328 -0.3228658 0.502686 -0.0290511 -0.0575226 0.0212982 0.0086906 0.0118868 0.1009889 0.0000433 0.0237496 -0.1126508 0.0275335 0.0409955 0.0558166 -0.1235847 0.3336914 0.1483476 0.0762392 0.2069434 0.1721142 0.052588 0.0856781 0.0426088 0.0199038 0.0189934 -0.0440755 0.0191352 -0.070264 0.1532352 -0.0192794 -0.0007469 -0.0227157 -0.1255628 0.2769201 0.1186801 0.0960088 0.0814326 0.2838694 0.0075125 0.1188791 0.0536088 -0.1297532 0.3756282 0.0224443 0.0399172 0.0151875 0.1533432 0.0842621 -0.0193667 0.0607738 0.2007934 -0.0522037 0.00674 0.0368119 -0.1656703 -0.1463769 -0.037408 0.0230758 -0.0004572 -0.1699596 0.0244731 0.0281099 0.040374 0.083995 0.0733838 0.026594 0.0524406 0.0042303 -0.1438839 -0.0159524 -0.0951589 -0.0155465 -0.1899472 -0.0665223 -0.0492359 -0.0209541 -0.028186 0.0357982 -0.1291944 0.02466 -0.0813241 0.0478309 0.0092625 -0.0937042 -0.1467467 -0.0617503 0.0113075 -0.0014748 -0.0641925 -0.0474975 -0.0357312 0.0521385 0.0003307 -0.0424885 -0.007442 0.1718383 0.040104 0.0789028 -0.0308057 0.093751 0.0245543 0.0133957 -0.0261698 0.0122574 0.1639905 0.0408128 0.0172017 0.0099534 0.0688154 0.0132101 0.0572109 0.0374034 0.018937 0.114733 0.0127271 -0.0203071 0.0290999 -0.1287782 0.0214782 -0.1008123 -0.0221036 -0.041029 -0.0134178 -0.0696665 0.0724883 -0.0482438 0.0586825 0.0673169 0.0104029 -0.0519096 0.014319 0.1509106 0.0968643 -0.000111 -0.0139872 -0.0005507 -0.0826227 -0.0095717 -0.0161918 -0.0038859 0.1612909 -0.0935835 0.0454133 -0.0424546 0.1584207 0.0083553 0.0310465 -0.0400987 0.0069577 0.1009047 0.056925 -0.0314541 -0.0123658 -0.057035 0.0298959 0.089294 0.045285 0.1012452 -0.011288 0.0576321 0.0117963 0.0463788 -0.0113673 0.0445352 -0.0979541 -0.0103771 -0.099775 -0.0245695 unknown
polarizability: 157.8549092|-3.9284|139.021237|11.0149213|-6.5436753|70.6431713 unknown
InChI: InChI=1S/C10H9N3/c1-8-3-2-6-13-9(4-5-11)7-12-10(8)13/h2-3,6-7H,4H2,1H3
charge 0 multiplicity 1
22 atoms
N  0.039374 0.194826 0.29453
N  -0.745021 -1.955189 0.050985
N  3.677632 1.286465 -1.015768
C  -1.095446 -0.637278 0.008224
C  1.124975 -0.666561 0.520425
C  -2.362024 -0.032317 -0.263554
C  -0.050475 1.582996 0.312758
C  0.608323 -1.963517 0.360455
C  2.503644 -0.186543 0.885177
C  -2.434431 1.365805 -0.234775
C  -1.279506 2.169697 0.05195
C  -3.541096 -0.925776 -0.566473
C  3.160454 0.624698 -0.168616
H  0.86026 2.150199 0.515333
H  1.157131 -2.899412 0.456617
H  3.138498 -1.067139 1.090249
H  2.494038 0.415106 1.818036
H  -3.390574 1.858404 -0.439592
H  -1.353634 3.26007 0.061324
H  -4.45239 -0.333295 -0.753295
H  -3.731351 -1.621381 0.270906
H  -3.336582 -1.555759 -1.451092
