program: Gaussian 09
title: 000007938
version: EM64L-G09RevD.01
frameworkgroup: C1[X(C6H8N2)]
method: RPBEPBE
basis: SDD
operation: Freq
keyword: #p
keyword: freq=noraman
keyword: PBEPBE/SDD
title: #p freq=noraman PBEPBE/SDD
converged: NO NO NO NO
title: Mulliken charges:
elementType: N N C C C C C C H H H H H H H H
charge: -0.053087 0.014770 0.200009 0.200037 -0.775793 -0.372394 -0.775791 -0.372405 0.231751 0.231806 0.254515 0.231798 0.231758 0.254517 0.249253 0.249255
chargesum: 0.00000
title: Mulliken charges with hydrogens summed into heavy atoms:
elementType: N N C C C C C C
charge: -0.053087 0.014770 0.200009 0.200037 -0.057721 -0.123141 -0.057718 -0.123150
polarizability: 1.03422036e+02 1.68981414e-04 7.74567852e+01 1.42043372e-03 -4.10064353e-03 4.21176057e+01
1716.lowfreq: -36.7498 -30.9260 -0.0010 -0.0008 -0.0007 15.7298 17.0014 27.1618 156.0001
frequency: -36.6397 -28.0702 155.9990 214.0070 269.1781 394.9410 453.3537 525.8247 541.0329 557.6543 688.1881 753.3151 871.2482 930.8643 932.4273 951.8772 990.2920 1021.4722 1044.6405 1056.4735 1144.5657 1233.6887 1267.1320 1281.5379 1385.1986 1393.0051 1398.6173 1404.7868 1456.4939 1469.2069 1469.6955 1470.7075 1519.2304 1539.6754 2985.9529 2986.2516 3066.7684 3066.9635 3111.9170 3112.1767 3133.4408 3138.1069
redmass: 1.0433 1.0365 2.6166 3.4807 2.5166 2.6762 7.7675 2.6454 5.5013 5.0655 7.0811 2.8614 1.3140 1.4003 2.7217 2.1916 2.5382 2.1377 1.5785 1.5999 2.5757 4.9019 2.0853 2.3918 1.9579 1.2240 1.4637 2.2611 1.1665 1.1673 1.0450 1.0460 5.1590 4.4208 1.0378 1.0377 1.0974 1.0974 1.0987 1.0987 1.0901 1.0955
irintensity: 0.0000 1.1832 0.0000 6.6841 1.8750 1.9690 8.1309 0.0000 0.0186 2.0772 1.4923 6.3628 18.8532 0.0000 8.0420 3.5623 4.9058 14.5414 20.1067 0.0001 9.2982 3.4922 10.5549 0.1799 1.3880 26.7323 7.4665 45.7218 45.7778 29.4442 0.0021 31.8094 38.0857 8.7466 26.3756 2.6789 0.0006 34.2081 0.2363 16.8008 36.6683 1.2922
temp: 298.150 k
press: 1.00000 atm
elementType: 7 7 6 6 6 6 6 6 1 1 1 1 1 1 1 1
symmnumber: 1
zpe: 337274.6 jmol-1
zpe.correction: 0.128461 hartree
zpe.thermalcorrener: 0.134753 hartree
zpe.thermalcorrenthalpy: 0.135697 hartree
zpe.thermalcorrgfe: 0.097967 hartree
zpe.sumelectzpe: -342.339310 hartree
zpe.sumelectthermal: -342.333019 hartree
zpe.sumelectthermalent: -342.332074 hartree
zpe.sumelectthermalfe: -342.369805 hartree
dipole: 0.0000 -0.8792 0.0005
dipole: 0.8792
quadrupole: -37.0281 -55.1820 -48.4662
quadrupole: -0.0001 0.0003 -0.0002
quadrupole: 9.8640 -8.2899 -1.5741 -0.0001 0.0003 -0.0002
hfenergy: -342.4677713 hartree
pointgroup: C01 [X(C6H8N2)]
dipole: 0.0000374 -0.3459089 0.000213 debye
dipolederiv: -0.4844172 -0.0000154 -0.0000046 -0.0000393 -0.244797 -0.000039 0.0000022 0.000005 -0.2690105 -0.0288061 0.0000276 0.000002 0.0000333 -0.2640974 -0.0000402 -0.0000022 0.0000028 -0.2587972 0.5043434 -0.2123099 0.0001057 -0.5194652 0.1668849 -0.0000495 0.0003216 -0.0001688 0.1023112 0.5042525 0.2123484 -0.0000751 0.5195184 0.1669466 -0.00002 -0.0002546 -0.0001141 0.1023007 -0.2757865 0.1405578 -0.0001297 0.1009589 -0.003087 -0.0000402 -0.0005685 0.000208 0.0419404 -0.0191329 0.0762837 0.0000383 0.4853321 -0.0255721 0.0000459 -0.0000054 0.0000536 -0.0630351 -0.2757445 -0.1405924 0.0000907 -0.1009838 -0.0031219 -0.0000321 0.000411 0.0001431 0.0419474 -0.0190913 -0.0762996 -0.0000233 -0.4853603 -0.0256474 0.000022 0.0000183 0.0000322 -0.0630535 0.0116072 0.0142436 0.0871898 0.0034194 0.0707871 0.0681554 0.1205029 0.0280198 -0.0356295 0.0118745 0.0145546 -0.0870722 0.0039497 0.0710905 -0.0677763 -0.1203083 -0.0277823 -0.0362132 0.0993555 -0.073773 -0.000109 0.0232061 -0.0870983 -0.0002885 0.0000966 -0.0003331 0.1181905 0.0118364 -0.0145169 0.0870972 -0.0038821 0.0710444 -0.067818 0.1203416 -0.0277995 -0.0361256 0.0116466 -0.0142979 -0.0871811 -0.0035033 0.0708293 0.0680891 -0.1204838 0.0279679 -0.0357178 0.0993574 0.073804 0.0000788 -0.0231783 -0.0870769 -0.0002046 -0.0000692 -0.000237 0.1181893 -0.075643 -0.0651789 0.0000015 -0.0979047 0.0614504 -0.0000044 0.0000215 -0.0000016 0.1363484 -0.0756521 0.0651644 -0.0000091 0.0978992 0.0614648 0.0000004 -0.0000236 0.0000039 0.1363545 unknown
polarizability: 103.4220361|0.0015382|77.4567853|0.0014206|-0.0041006|42.1176057 unknown
InChI: InChI=1S/C6H8N2/c1-5-3-7-4-6(2)8-5/h3-4H,1-2H3
charge 0 multiplicity 1
16 atoms
N  0.000051 -1.033667 0.000158
N  -0.000075 1.816563 0.000076
C  1.17484 -0.325812 0.00017
C  -1.174831 -0.325899 0.000149
C  2.467794 -1.109304 0.000283
C  1.159679 1.096162 0.000117
C  -2.467681 -1.10956 0.000227
C  -1.159782 1.096046 0.00009
H  3.079839 -0.873182 -0.889904
H  3.078221 -0.875419 0.892187
H  2.246258 -2.1883 -0.001193
H  -3.078378 -0.875427 0.891876
H  -3.079517 -0.873845 -0.890216
H  -2.245978 -2.188521 -0.000824
H  2.090366 1.674022 0.000084
H  -2.090507 1.673843 0.00002
