program: Gaussian 09
title: 000087258
version: EM64L-G09RevD.01
frameworkgroup: C1[X(C6H10NO4PS3)]
method: RPBEPBE
basis: SDD
operation: Freq
keyword: #p
keyword: freq=noraman
keyword: PBEPBE/SDD
title: #p freq=noraman PBEPBE/SDD
converged: YES YES NO NO
title: Mulliken charges:
elementType: S S S P O O O O N C C C C C C H H H H H H H H H H
charge: 0.042667 0.261096 -0.218270 0.627253 -0.447381 -0.476035 -0.197797 -0.157685 -0.117003 -0.632690 0.325067 -0.772260 -0.049962 -0.480051 -0.489952 0.347642 0.315874 0.311530 0.309791 0.237748 0.250785 0.243770 0.281226 0.238535 0.246100
chargesum: 0.00000
title: Mulliken charges with hydrogens summed into heavy atoms:
elementType: S S S P O O O O N C C C C C C
charge: 0.042667 0.261096 -0.218270 0.627253 -0.447381 -0.476035 -0.197797 -0.157685 -0.117003 0.030827 0.325067 -0.150939 -0.049962 0.252252 0.275909
polarizability: 2.27335611e+02 -1.65342217e+01 1.62904648e+02 7.56888270e+00 -3.95255946e+00 1.17065681e+02
1716.lowfreq: -13.1174 -7.6914 -0.0020 -0.0006 0.0020 3.3337 7.2501 31.5024 51.4509
frequency: -1.1756 31.4208 51.4371 59.9774 73.9376 86.9173 98.1238 106.7890 118.2373 129.0279 131.6405 133.9437 154.8747 174.5844 210.5323 266.3981 296.6758 320.4913 345.6050 355.9144 368.4427 385.9139 440.5650 471.1165 523.9522 554.7529 569.2571 600.9523 627.4180 658.7359 676.8833 690.8017 732.3726 833.5326 896.8151 914.7415 946.1597 980.7576 1047.2150 1112.9221 1121.1396 1122.9434 1127.0809 1128.4664 1135.9316 1233.8554 1271.1266 1308.4077 1332.1293 1421.7278 1422.0603 1423.6213 1426.7476 1454.3126 1458.1442 1469.2141 1474.2880 1628.6883 1688.4178 2978.7634 2996.4973 3049.7709 3053.1091 3079.0920 3112.8798 3125.2706 3132.7844 3139.4526 3147.8694
redmass: 8.2048 8.9682 6.6627 3.5903 7.6816 1.1503 7.5860 4.0392 3.1176 3.0124 4.3003 1.4789 4.6214 6.8199 6.4523 10.5751 3.2585 5.1168 5.6432 7.2830 10.3035 9.5270 12.9145 10.3312 16.4175 3.6014 9.8329 9.6865 5.8533 10.7890 6.9614 11.9027 5.6990 2.5060 1.6786 2.9755 10.9965 11.5871 4.2871 1.2508 2.6781 1.2707 1.2777 1.1894 1.2921 1.3958 1.9837 1.5036 1.8435 1.1130 1.0851 1.1029 1.1140 1.0488 1.0501 1.0518 1.0514 12.5225 11.5536 1.0307 1.0301 1.0580 1.0572 1.1050 1.1025 1.1066 1.1019 1.1060 1.1098
irintensity: 0.3316 0.1067 0.7314 1.0499 1.9042 0.2647 5.8485 7.1407 2.8259 8.7599 2.5632 0.9544 7.4465 2.6592 0.6357 9.8866 15.6987 16.2694 15.6398 7.7483 1.6726 36.5111 30.1954 46.1856 177.0323 0.9094 6.8871 3.2852 35.2099 43.7827 28.9509 127.9624 7.3975 17.2439 8.3559 55.5343 258.5828 27.7117 4.4450 0.7926 84.3829 7.1558 3.0695 4.3060 0.4546 87.9394 286.6890 40.1855 126.3425 7.8784 26.0128 21.6457 15.0842 12.4498 6.6430 17.5872 21.3947 515.0451 66.5695 43.8112 40.0438 5.1763 3.5368 22.1307 4.8914 0.0225 8.7029 5.8065 8.5954
temp: 298.150 k
press: 1.00000 atm
elementType: 16 16 16 15 8 8 8 8 7 6 6 6 6 6 6 1 1 1 1 1 1 1 1 1 1
symmnumber: 1
zpe: 440486.7 jmol-1
zpe.correction: 0.167773 hartree
zpe.thermalcorrener: 0.185703 hartree
zpe.thermalcorrenthalpy: 0.186647 hartree
zpe.thermalcorrgfe: 0.119863 hartree
zpe.sumelectzpe: -2124.535482 hartree
zpe.sumelectthermal: -2124.517552 hartree
zpe.sumelectthermalent: -2124.516608 hartree
zpe.sumelectthermalfe: -2124.583392 hartree
dipole: -2.5113 0.9872 -1.2041
dipole: 2.9549
quadrupole: -107.3620 -119.3579 -122.6231
quadrupole: 4.6838 -4.0874 1.5838
quadrupole: 9.0857 -2.9102 -6.1755 4.6838 -4.0874 1.5838
hfenergy: -2124.7032549 hartree
pointgroup: C01 [X(C6H10N1O4P1S3)]
dipole: 0.989069 0.2946858 0.5351546 debye
dipolederiv: -0.9820292 -0.078816 0.0292967 -0.1580413 -0.2566567 0.0209712 -0.1500778 -0.0564284 -0.2351905 -0.7635044 0.0148385 0.0956885 0.0536424 -0.0197744 -0.0004801 0.1898457 0.0004518 -0.0518413 -0.6888114 -0.0755847 -0.1786675 -0.1200862 -0.3965264 -0.073918 -0.2052267 -0.0886608 -0.4856907 2.2248743 0.0548497 0.2132472 0.2277436 1.4512203 0.101766 -0.1666337 0.1177043 1.313637 -0.8010049 0.2348171 0.0379553 0.3984033 -1.0771514 -0.1646053 0.2421357 -0.2510617 -0.5680339 -0.6388656 0.0986321 -0.098571 0.003418 -1.1855655 0.1870143 -0.0300325 0.2822258 -0.5825272 -0.5060868 0.0806656 0.0223646 -0.2904405 -1.0868511 -0.1239407 -0.01319 -0.1203961 -0.3269439 -1.0196895 -0.3611629 0.1111136 -0.3341921 -0.7817719 0.0747662 0.1155565 0.0268558 -0.2624978 -1.46032 -0.2759271 -0.0529149 0.1424538 -1.3542915 -0.0947752 0.1458907 -0.0960277 -0.1725117 1.057327 -0.1789119 0.2059784 -0.4036237 0.0663242 -0.0443698 0.4346792 0.0598487 0.2498062 1.1911217 0.3160246 -0.0650839 0.6775735 1.3702885 0.1714183 -0.1502214 0.0648691 0.2204349 -0.3341686 0.2697488 0.1053875 0.1831336 0.1755656 -0.0257306 0.1383206 -0.0559674 0.067035 1.7815938 0.0810214 -0.2843573 -0.1609806 1.4732265 0.0081046 -0.3861977 0.1391301 0.2159662 0.3409774 -0.1742688 -0.0562805 -0.2604838 0.6541193 0.1072903 0.1451551 -0.2065167 0.1204651 0.1979221 -0.016844 -0.0131751 -0.076345 0.724158 -0.1914398 -0.0171898 0.1559509 0.1126195 0.0603507 0.0367263 -0.0036232 0.0218535 0.0904093 0.0664837 -0.0847367 0.0229753 0.0585405 -0.017983 -0.0233366 -0.0761127 0.0722801 0.0596122 -0.0371426 -0.1020378 -0.0241092 0.0331032 0.121174 -0.0023854 0.0168784 -0.036171 0.0115607 0.0451755 0.0417736 0.0304086 0.0369056 0.0717913 -0.0117944 -0.0495804 -0.0417898 0.0285482 -0.0298593 -0.0766459 -0.0325715 0.0623976 -0.0246484 -0.0941061 0.0768853 -0.0215709 -0.0165301 0.0213847 0.0169936 0.12147 0.0583834 0.088273 0.0565173 0.0392587 0.0770243 -0.001884 -0.0802358 0.0464107 -0.0766641 -0.013171 -0.0494153 0.0339113 -0.0734772 -0.0266048 0.02865 -0.0422106 -0.1510631 0.0603629 0.0483418 0.0673878 0.0803031 0.0567973 0.0649519 0.0276574 0.0124954 0.0817868 -0.048514 0.0700031 -0.0388816 -0.0789243 -0.0684938 0.0140563 0.036688 0.0083902 -0.0907944 -0.1062791 0.0667212 0.1226156 0.0140066 0.0094861 -0.0062049 -0.0210254 0.0834474 0.0254992 0.0809433 -0.0359524 unknown
polarizability: 228.2688614|11.4615963|160.4681134|13.2842097|6.5343549|118.5689656 unknown
InChI: InChI=1S/C4H4NO2S2.C2H6O2PS/c6-3-1-9-4(7)5(3)2-8;1-3-5(6)4-2/h1-2H2;1-2H3
charge 0 multiplicity 1
25 atoms
S  -0.64071 0.927287 -1.068751
S  3.715924 -1.495852 -0.466006
S  -3.923374 -0.52553 -1.831829
P  -2.638442 0.016977 -0.317136
O  -3.157331 1.18113 0.859743
O  -2.18256 -1.135108 0.886218
O  2.728831 2.317054 0.203086
O  1.079936 -2.083688 0.09074
N  1.723598 0.188325 0.205171
C  0.391453 0.690471 0.532367
C  2.814098 1.077864 0.042701
C  4.09738 0.346199 -0.339152
C  1.943437 -1.196783 -0.011688
C  -3.67492 2.47126 0.351762
C  -2.124254 -2.576904 0.52525
H  -0.149582 -0.03487 1.159948
H  0.501575 1.670906 1.014688
H  4.461639 0.718803 -1.30898
H  4.866176 0.515862 0.430402
H  -2.885502 3.026094 -0.1887
H  -3.973387 3.01915 1.257238
H  -4.548621 2.312081 -0.305907
H  -1.161684 -2.796295 0.038129
H  -2.977322 -2.850333 -0.121171
H  -2.19356 -3.0955 1.492976
