program: Gaussian 09
title: 000087207
version: EM64L-G09RevD.01
frameworkgroup: C1[X(C4H6Cl2O2)]
method: RPBEPBE
basis: SDD
operation: Freq
keyword: #p
keyword: freq=noraman
keyword: PBEPBE/SDD
title: #p freq=noraman PBEPBE/SDD
converged: NO NO NO NO
title: Mulliken charges:
elementType: Cl Cl O O C C C C H H H H H H
charge: 0.029905 0.058125 -0.258557 -0.186871 -0.470418 -0.577362 0.405157 -0.495333 0.259768 0.237476 0.258304 0.239372 0.249127 0.251308
chargesum: 0.00000
title: Mulliken charges with hydrogens summed into heavy atoms:
elementType: Cl Cl O O C C C C
charge: 0.029905 0.058125 -0.258557 -0.186871 -0.470418 0.178186 0.405157 0.244473
polarizability: 7.53117616e+01 -5.10095209e+00 7.06447782e+01 -3.15017911e+00 -3.62707920e-02 5.86520261e+01
1716.lowfreq: -9.5864 -3.6772 -0.0030 -0.0024 -0.0023 7.8364 30.1175 102.0747 119.8352
frequency: 30.0960 102.0709 119.8316 173.6314 209.8906 237.2602 277.2924 291.4479 309.8732 319.2881 378.3642 492.8744 607.5007 679.3817 723.9771 800.8558 937.1829 1069.2446 1083.9142 1096.2832 1113.5002 1149.4995 1204.5400 1397.2682 1422.4511 1453.1176 1453.3746 1456.0765 1462.5984 1655.3430 3011.3059 3012.2844 3114.3693 3115.1377 3134.9338 3161.5503
redmass: 7.2721 1.3004 2.6140 4.2646 9.0159 6.4061 1.2497 4.4945 2.8762 3.6170 7.9405 6.9394 6.3235 4.5149 7.2901 5.0363 4.6765 1.7680 2.1549 4.9296 1.2713 1.4726 4.4021 1.1946 1.1670 1.0486 1.0457 1.0470 1.0507 10.9151 1.0296 1.0355 1.0993 1.1047 1.1016 1.1052
irintensity: 0.9750 0.8006 0.9241 2.5618 3.8470 4.9449 0.3056 4.8366 3.8466 2.8671 7.9480 27.3048 79.6911 20.3397 15.3556 15.8234 8.2264 67.1399 237.8923 26.1262 0.9610 20.1199 66.7244 21.3612 12.5080 21.3660 6.2801 14.1539 12.7736 151.0153 23.5939 3.5755 4.2253 22.6608 5.1181 11.6178
temp: 298.150 k
press: 1.00000 atm
elementType: 17 17 8 8 6 6 6 6 1 1 1 1 1 1
symmnumber: 1
zpe: 252756.6 jmol-1
zpe.correction: 0.096270 hartree
zpe.thermalcorrener: 0.105993 hartree
zpe.thermalcorrenthalpy: 0.106937 hartree
zpe.thermalcorrgfe: 0.060110 hartree
zpe.sumelectzpe: -1225.945152 hartree
zpe.sumelectthermal: -1225.935429 hartree
zpe.sumelectthermalent: -1225.934485 hartree
zpe.sumelectthermalfe: -1225.981312 hartree
dipole: -2.7480 1.1698 2.6938
dipole: 4.0220
quadrupole: -51.7729 -64.4986 -60.4853
quadrupole: -0.3019 0.9150 -2.0866
quadrupole: 7.1460 -5.5796 -1.5663 -0.3019 0.9150 -2.0866
hfenergy: -1226.0414222 hartree
pointgroup: C01 [X(C4H6Cl2O2)]
dipole: -0.9939819 -1.1006416 -0.5517935 debye
dipolederiv: -0.2489107 0.0492774 -0.101597 0.0368796 -0.2149774 0.1208989 -0.0546245 0.1433576 -0.6673586 -0.3240537 -0.2450701 0.1441178 -0.2079877 -0.4219923 0.1555815 0.0923127 0.1254084 -0.2378859 -1.2745866 -0.3272897 -0.0323018 -0.3676361 -0.6888933 -0.0685698 -0.0009964 -0.0317789 -0.2711157 -0.5823879 0.2088524 -0.0014457 -0.0949253 -0.8512437 -0.0281483 -0.0114825 -0.0666272 -0.2599948 0.4280733 0.2528063 -0.1135044 0.3627815 0.7242715 -0.2475928 -0.1130415 -0.2429328 1.073611 -0.1125038 -0.02209 0.0057755 -0.0113583 -0.191743 -0.0525855 0.0222866 -0.0568923 -0.1461675 1.3292598 0.0947424 0.1236102 0.3152981 1.195351 0.1016761 0.1273388 0.0948973 0.0736384 0.665498 0.0704602 -0.0037588 -0.0257748 0.2069438 -0.0102236 -0.0260496 -0.0147291 0.2736333 0.0779389 -0.077201 0.0397179 -0.1034944 0.0138591 0.0215455 0.0211457 0.0205207 0.0848705 0.1170561 0.0165714 -0.0412162 0.0025306 0.0681889 0.0204018 -0.0488609 0.0274359 -0.0745521 -0.0634081 0.0722581 -0.0010989 0.0615973 0.0849713 -0.0171232 -0.0121729 -0.0078546 0.1110204 0.0065762 -0.0631536 -0.0035569 -0.1082155 -0.0411804 -0.0171342 -0.008093 -0.0183873 0.122179 -0.0123012 -0.0132952 0.002475 0.0830531 0.0366664 0.1012284 -0.0376283 0.0863512 -0.0168754 -0.0062503 -0.0168685 -0.0172166 0.057252 0.0797782 -0.0799549 0.0498658 -0.0587688 -0.0650026 unknown
polarizability: 74.3004887|6.6448931|67.0338979|-0.168075|-5.8481637|63.2741792 unknown
InChI: InChI=1S/C4H6Cl2O2/c1-4(5,6)3(7)8-2/h1-2H3
charge 0 multiplicity 1
14 atoms
Cl 1.367772 -0.616145 1.693926
Cl 2.098643 1.147147 -0.689721
O  -1.417167 -0.647731 -0.123823
O  -0.807014 1.590504 0.082486
C  0.931819 -0.195564 -0.105762
C  1.116719 -1.439847 -0.963045
C  -0.498242 0.392383 -0.044312
C  -2.841622 -0.248532 0.015915
H  0.440463 -2.235999 -0.61519
H  0.882269 -1.204797 -2.01586
H  2.160494 -1.784615 -0.898301
H  -3.405651 -1.186519 -0.071025
H  -3.114838 0.461802 -0.781677
H  -3.002246 0.227014 0.997588
