program: Gaussian 09
title: 000087211
version: EM64L-G09RevD.01
frameworkgroup: C1[X(C14H10O4)]
method: RPBEPBE
basis: SDD
operation: Freq
keyword: #pfreq=noraman
keyword: PBEPBE/SDD
title: #p freq=noraman PBEPBE/SDD
converged: NO NO NO NO
title: Mulliken charges:
elementType: O O O O C C C C C C C C C C C C C C H H H H H H H H H H
charge: -0.353688 -0.389167 -0.172276 -0.323596 0.144975 0.094613 -0.521117 -0.505318 0.046605 0.154245 0.349463 0.268748 -0.139337 -0.140417 -0.370007 -0.385917 -0.255463 -0.231247 0.238271 0.256100 0.253791 0.257349 0.201309 0.296905 0.238054 0.242839 0.355828 0.388456
chargesum: 0.00000
title: Mulliken charges with hydrogens summed into heavy atoms:
elementType: O O O O C C C C C C C C C C C C C C
charge: 0.002139 -0.000711 -0.172276 -0.323596 0.144975 0.094613 -0.026746 0.005823 0.046605 0.154245 0.349463 0.268748 -0.139337 -0.140417 -0.168698 -0.089013 -0.017410 0.011591
polarizability: 2.79892500e+02 3.65322962e+00 1.84135170e+02 1.47410869e+00 -2.07502341e+00 7.20137974e+01
1716.lowfreq: -10.8750 -4.7632 0.0002 0.0005 0.0010 6.9451 52.7206 60.6340 101.4194
frequency: 52.7003 60.6298 101.4179 134.6819 163.1611 186.0313 206.9955 239.8827 282.3662 303.2445 343.4037 351.9799 374.7998 387.6200 417.9195 432.1875 449.4520 480.7303 497.5985 501.4956 528.7898 579.2980 604.6956 627.2496 639.9962 668.9103 713.9626 735.2256 773.9915 790.7040 810.0232 825.9114 881.3952 894.1422 927.5262 967.8488 983.9440 1006.9677 1011.7689 1033.4413 1035.3647 1070.4433 1087.2434 1133.5227 1140.9920 1153.6755 1177.5962 1192.5425 1232.5701 1255.2686 1285.7668 1290.9411 1293.6480 1329.9393 1336.1638 1376.4308 1397.3419 1421.5464 1433.0429 1442.1987 1450.5267 1457.0969 1504.1686 1553.2050 1578.9801 1590.7906 1607.1634 1631.2437 2439.5420 2982.7076 2989.6339 3070.0752 3088.4339 3100.5210 3143.5137 3161.5776 3179.0200 3551.3889
redmass: 5.3606 5.9469 4.0897 4.9751 3.1933 4.2981 6.1033 4.1841 2.0678 3.5475 4.4552 6.1148 5.1887 6.0857 4.0522 4.0573 8.8264 3.2737 5.1631 5.3000 7.1484 4.3944 3.8036 5.0078 5.4049 3.8297 4.3032 4.5015 1.6001 4.7505 2.5157 2.2898 4.6209 2.2691 5.4253 1.3922 2.2679 1.3596 2.3337 1.1434 2.0825 4.1400 3.3702 1.5008 1.7116 1.8280 1.2768 1.3533 2.3108 1.8567 1.8615 1.5035 3.6444 1.7480 2.8593 4.8410 5.4100 5.3926 2.2112 1.1463 1.1654 3.6215 3.2195 7.5859 8.6745 2.5605 7.5432 5.5906 1.0802 1.0676 1.0632 1.0950 1.0968 1.0884 1.0888 1.0943 1.0983 1.0651
irintensity: 6.2057 0.2694 5.8306 1.9158 1.0787 0.9702 1.9304 6.1711 57.2372 25.9847 9.7546 7.6735 12.6042 7.8725 11.6266 13.3509 1.9073 8.3685 4.0692 7.1763 17.0599 1.7359 1.0948 4.3420 4.3058 12.6568 1.2161 9.7361 75.7617 24.2904 3.3242 1.8865 32.7074 0.7117 28.7170 0.9692 62.9368 0.6206 15.1311 117.4702 32.4724 32.4693 37.5743 27.8644 76.1087 26.2774 88.3965 88.0532 9.7293 29.4148 108.3760 2.1906 39.9842 70.3810 24.2735 348.7556 110.0356 50.4014 22.3485 8.6684 16.6198 42.3806 73.0759 33.6084 146.8524 66.2755 75.7970 61.6813 303.1449 3.2365 18.3190 15.1837 17.5010 12.3654 9.2059 14.9700 12.3211 24.8775
temp: 298.150 k
press: 1.00000 atm
elementType: 8 8 8 8 6 6 6 6 6 6 6 6 6 6 6 6 6 6 1 1 1 1 1 1 1 1 1 1
symmnumber: 1
zpe: 539156.4 jmol-1
zpe.correction: 0.205354 hartree
zpe.thermalcorrener: 0.219398 hartree
zpe.thermalcorrenthalpy: 0.220342 hartree
zpe.thermalcorrgfe: 0.164718 hartree
zpe.sumelectzpe: -839.156233 hartree
zpe.sumelectthermal: -839.142189 hartree
zpe.sumelectthermalent: -839.141244 hartree
zpe.sumelectthermalfe: -839.196868 hartree
dipole: 3.5675 0.2412 0.8638
dipole: 3.6785
quadrupole: -82.2799 -117.5537 -104.4097
quadrupole: 10.3763 -1.1937 2.6622
quadrupole: 19.1345 -16.1393 -2.9953 10.3763 -1.1937 2.6622
hfenergy: -839.3615868 hartree
pointgroup: C01 [X(C14H10O4)]
dipole: -1.3977317 -0.0931089 0.3635702 debye
polarizability: 279.781489|3.7346904|184.1682024|-4.9109604|1.0595943|72.0917758 unknown
InChI: InChI=1S/C14H10O4/c15-9-5-6-10(16)12-11(9)13(17)7-3-1-2-4-8(7)14(12)18/h1-4,17-18H,5-6H2
charge 0 multiplicity 1
28 atoms
O  -0.271535 -2.852978 0.053593
O  -0.308401 2.770717 0.0105
O  2.411175 -2.717148 -0.286307
O  2.163739 2.748717 -0.136652
C  0.949232 -0.778052 -0.027754
C  0.944852 0.680493 -0.035202
C  3.467229 -0.647596 0.434004
C  3.499985 0.718348 -0.287399
C  2.264516 -1.496362 0.001864
C  2.184759 1.449887 -0.140358
C  -1.544112 -0.736153 0.019973
C  -1.541145 0.703519 0.043709
C  -0.280164 -1.460554 0.009206
C  -0.281058 1.40509 0.013157
C  -2.808509 -1.405324 0.010308
C  -2.77152 1.423496 0.078748
C  -4.00894 -0.683579 0.04602
C  -3.993398 0.741355 0.086363
H  3.400409 -0.4804 1.52816
H  4.38361 -1.227516 0.236638
H  3.686365 0.563705 -1.369986
H  4.309948 1.367137 0.088183
H  -2.873723 -2.49984 -0.049065
H  -2.727656 2.515889 0.096315
H  -4.964391 -1.218609 0.033285
H  -4.936045 1.297165 0.115268
H  -1.171529 -3.209811 0.262748
H  0.703907 3.081804 -0.04052
