program: Gaussian 09
title: 000087218
version: EM64L-G09RevD.01
frameworkgroup: C1[X(C19H22N2O)]
method: RPBEPBE
basis: SDD
operation: Freq
keyword: #p
keyword: freq=noraman
keyword: PBEPBE/SDD
title: #p freq=noraman PBEPBE/SDD
converged: YES YES NO NO
title: Mulliken charges:
elementType: O N N C C C C C C C C C C C C C C C C C C C H H H H H H H H H H H H H H H H H H H H H H
charge: -0.250745 -0.151587 -0.149207 0.292236 0.291819 0.318203 0.397464 0.398524 -0.409145 -0.402075 -0.442429 -0.430677 -0.365035 -0.366247 -0.368672 -0.364530 -0.424684 -0.645901 -0.646182 -0.646464 -0.645808 -0.165438 0.255676 0.256196 0.264766 0.247513 0.237130 0.236609 0.239211 0.237453 0.247988 0.234773 0.218055 0.236271 0.234534 0.240007 0.217397 0.236230 0.218191 0.236259 0.239067 0.235370 0.217684 0.190199
chargesum: 0.00000
title: Mulliken charges with hydrogens summed into heavy atoms:
elementType: O N N C C C C C C C C C C C C C C C C C C C
charge: -0.250745 -0.151587 -0.149207 0.292236 0.291819 0.318203 0.397464 0.398524 -0.153468 -0.145879 -0.177663 -0.183165 -0.127905 -0.129637 -0.129461 -0.127077 -0.176696 0.043198 0.045756 0.044216 0.046314 0.024761
polarizability: 4.18848610e+02 -1.24878309e+01 2.96974161e+02 1.09326711e+01 -1.01021201e+00 1.38177975e+02
1716.lowfreq: -7.1322 -0.9918 0.0003 0.0006 0.0008 6.8567 33.1676 35.5907 43.9764
frequency: 33.1388 35.5858 43.9491 49.4482 74.6018 84.0226 90.5118 98.8256 104.4225 119.8617 131.3358 176.2519 182.2809 194.4707 200.2565 215.1287 215.8354 237.3385 267.8426 282.5273 309.3069 328.0370 350.7799 394.5255 421.4046 427.1458 434.1207 435.0217 470.6474 477.6767 511.3369 530.3456 550.4864 579.9439 623.0655 632.1395 655.6865 688.3482 727.4961 742.1424 750.1045 776.4871 807.0834 812.5537 824.1822 825.3119 878.7673 899.6778 942.3717 943.9950 953.3548 956.4738 962.9730 968.2249 973.4258 994.9959 999.1057 1055.4542 1056.8647 1107.8425 1107.9005 1110.5668 1111.3960 1122.7465 1133.6902 1141.8657 1166.2747 1166.7434 1183.7926 1204.6579 1215.0612 1258.6741 1260.0573 1260.6685 1311.5166 1320.9003 1347.4957 1360.0787 1363.9241 1365.4987 1371.0677 1379.2163 1427.6127 1428.6204 1442.4730 1445.2400 1457.9755 1460.2086 1464.2355 1464.3738 1475.7265 1475.7851 1492.0200 1492.6519 1503.5250 1505.1021 1519.5838 1529.7586 1534.8941 1543.9318 1555.1643 1574.2660 1623.3326 1633.0755 2901.6009 2941.1193 2942.0661 2948.6240 2949.8174 3007.3736 3009.0500 3010.7218 3012.2499 3095.9000 3097.8963 3106.5982 3107.5345 3124.9750 3134.4079 3135.4586 3136.4204 3138.9015 3163.5770 3164.1057 3167.8633 3168.5482
redmass: 4.0409 3.6061 3.6405 3.6810 3.6292 2.9512 3.7896 2.2443 2.4779 1.7332 1.8842 2.8885 3.2424 1.2920 1.1755 2.4131 2.5282 3.2981 3.0067 3.2696 4.2635 4.2003 3.9255 5.7414 3.0430 3.0707 3.1381 3.5307 3.6446 3.6166 2.9829 2.6812 3.5451 3.8659 5.4226 6.9408 3.9396 3.9606 4.7330 4.1989 4.3804 5.1035 1.2599 1.2558 1.7831 1.8716 1.3805 4.4159 3.1277 3.0808 1.3751 1.3503 1.3911 1.4152 1.4870 3.1733 2.7215 1.4990 1.4968 1.2389 1.2381 1.3232 1.3226 3.1554 1.4891 1.6671 1.7513 1.7196 2.0522 1.1361 1.1712 1.9358 2.8007 2.7607 1.4888 1.4132 2.0987 1.6676 3.1128 3.1249 3.6665 3.8129 1.5054 1.3321 2.0701 2.4941 1.2168 1.2304 1.0401 1.0420 1.0466 1.0459 1.1011 1.0998 1.2411 1.1312 2.6974 2.6851 4.2783 6.2492 7.1896 4.4687 5.9201 6.2378 1.0846 1.0370 1.0366 1.0395 1.0393 1.0996 1.0995 1.1025 1.1026 1.0966 1.0960 1.0944 1.0941 1.0894 1.0883 1.0879 1.0883 1.0876 1.0936 1.0937 1.0948 1.0948
irintensity: 1.5085 1.5763 0.2614 0.5030 2.3599 0.6317 1.6888 1.8737 6.2658 1.0142 0.8975 0.2373 4.1102 0.5275 0.1007 1.5776 1.4329 0.6864 4.9417 3.5027 2.6037 6.3806 5.3368 2.5430 2.7678 1.3406 1.4198 4.9407 2.3420 6.9988 13.6364 0.3411 11.0501 6.6220 3.6919 1.7321 7.6369 10.1156 4.6003 0.7994 8.7428 3.4246 9.4340 4.5418 64.3878 72.0578 32.1737 13.9207 10.4499 42.6852 1.8410 1.3198 3.5865 2.1092 0.7239 0.1437 1.6226 24.3963 25.6636 0.3043 0.4241 0.9332 1.0421 59.2675 3.2466 34.5706 3.0848 19.7690 27.6103 226.5842 51.7181 42.4735 27.0615 45.2998 9.8106 0.4924 27.3508 75.7979 121.3300 221.2116 138.1718 203.1928 5.1631 6.2635 0.9076 7.1653 12.0657 9.4692 0.0394 0.1352 22.9597 22.1835 1.0637 2.4863 16.1790 100.3774 74.0624 249.3480 31.3050 9.5044 14.6719 806.4526 716.7498 77.4326 89.9421 99.4894 96.8843 187.5051 96.5084 10.4373 8.6429 72.7052 75.4396 4.1410 3.8324 51.9001 48.2485 11.9749 7.2433 3.6220 10.3636 4.7772 22.3660 23.2572 17.5119 9.8839
temp: 298.150 k
press: 1.00000 atm
elementType: 8 7 7 6 6 6 6 6 6 6 6 6 6 6 6 6 6 6 6 6 6 6 1 1 1 1 1 1 1 1 1 1 1 1 1 1 1 1 1 1 1 1 1 1
symmnumber: 1
zpe: 953392.0 jmol-1
zpe.correction: 0.363128 hartree
zpe.thermalcorrener: 0.385420 hartree
zpe.thermalcorrenthalpy: 0.386365 hartree
zpe.thermalcorrgfe: 0.310635 hartree
zpe.sumelectzpe: -920.315641 hartree
zpe.sumelectthermal: -920.293349 hartree
zpe.sumelectthermalent: -920.292405 hartree
zpe.sumelectthermalfe: -920.368134 hartree
dipole: 1.4888 -9.5461 0.0638
dipole: 9.6617
quadrupole: -70.6931 -155.5484 -131.1823
quadrupole: 10.2944 3.2871 -0.4677
quadrupole: 48.4481 -36.4071 -12.0410 10.2944 3.2871 -0.4677
hfenergy: -920.6787692 hartree
pointgroup: C01 [X(C19H22N2O1)]
dipole: -0.7253909 -3.6647686 0.7018277 debye
polarizability: 416.6873807|13.9392148|289.9423633|28.3513317|-30.5334557|147.371002 unknown
InChI: InChI=1S/C19H22N2O/c1-20(2)17-9-5-15(6-10-17)19(13-14-22)16-7-11-18(12-8-16)21(3)4/h5-14H,1-4H3
charge 0 multiplicity 1
44 atoms
O  1.316835 4.720516 -1.043185
N  4.760979 -1.822947 0.582178
N  -5.186042 -1.1821 -0.083293
C  0.00721 1.335391 -0.317498
C  1.22332 0.515633 -0.073623
C  -1.316441 0.666164 -0.282309
C  3.607651 -1.064276 0.372336
C  -3.926397 -0.584113 -0.150313
C  1.381294 -0.776005 -0.65427
C  -1.555851 -0.482539 0.527432
C  2.284423 0.983268 0.754544
C  -2.422683 1.160984 -1.034683
C  2.538509 -1.544454 -0.453673
C  -2.817749 -1.091684 0.602397
C  3.440667 0.221246 0.983089
C  -3.688408 0.560861 -0.980251
C  0.081927 2.709827 -0.547302
C  4.897881 -3.145722 -0.040889
C  5.846542 -1.294759 1.41883
C  -5.395471 -2.363882 0.763409
C  -6.311248 -0.618586 -0.841352
C  1.289189 3.456413 -0.884705
H  0.587551 -1.168379 -1.300002
H  -0.737065 -0.885117 1.133721
H  2.174204 1.94793 1.262366
H  -2.273121 2.017981 -1.701124
H  2.616134 -2.517425 -0.946767
H  -2.946377 -1.957679 1.257604
H  4.211456 0.622901 1.646541
H  -4.493634 0.973405 -1.594454
H  -0.837168 3.309472 -0.535066
H  4.092771 -3.837258 0.280618
H  5.861803 -3.590339 0.252064
H  4.873346 -3.085082 -1.148194
H  5.518301 -1.127695 2.465128
H  6.23654 -0.334033 1.026433
H  6.679206 -2.015196 1.436746
H  -5.200531 -2.145245 1.833262
H  -6.439882 -2.700614 0.671277
H  -4.738703 -3.204792 0.462143
H  -6.517738 0.43103 -0.549874
H  -6.123396 -0.638698 -1.934122
H  -7.218936 -1.209914 -0.643466
H  2.212401 2.852112 -1.054602
