program: Gaussian 09
title: 000087183
version: EM64L-G09RevD.01
frameworkgroup: C1[X(C16H15NO4)]
method: RPBEPBE
basis: SDD
operation: Freq
keyword: #p
keyword: freq=noraman
keyword: PBEPBE/SDD
title: #p freq=noraman PBEPBE/SDD
converged: YES YES NO NO
title: Mulliken charges:
elementType: O O O O N C C C C C C C C C C C C C C C C H H H H H H H H H H H H H H H
charge: -0.289569 -0.438638 -0.198893 -0.299273 -0.405447 -0.330726 0.512233 -0.389534 -0.372020 0.173794 -0.477735 0.474394 0.306504 -0.223685 -0.219537 -0.238433 -0.364024 -0.394135 -0.227290 -0.225737 -0.233690 0.291827 0.359863 0.237179 0.241107 0.245015 0.220109 0.229312 0.226652 0.230650 0.273763 0.231570 0.227979 0.226225 0.228639 0.391551
chargesum: 0.00000
title: Mulliken charges with hydrogens summed into heavy atoms:
elementType: O O O O N C C C C C C C C C C C C C C C C
charge: -0.289569 -0.047088 -0.198893 -0.299273 -0.045584 -0.038898 0.512233 -0.152354 -0.130913 0.173794 -0.012611 0.474394 0.306504 0.005627 0.007115 -0.007783 -0.090261 -0.162566 0.000689 0.000488 -0.005051
polarizability: 1.83839859e+02 5.91720356e+00 2.00635383e+02 2.81840530e+01 -8.66550097e+00 1.61646529e+02
1716.lowfreq: -20.1721 -11.4271 -3.6208 -1.6564 -0.0011 -0.0010 -0.0010 14.4255 20.7629
frequency: -19.7470 14.3519 20.3856 36.5539 47.9046 58.2123 78.9409 90.2507 103.7441 151.1782 193.6998 210.2578 243.8650 252.9826 290.7445 331.4068 359.2152 394.2500 399.8108 405.0950 473.2982 482.4313 518.6319 566.8638 581.1346 594.0989 610.6231 614.8624 617.7064 628.7017 661.2179 693.3601 700.0234 703.1322 707.8871 756.3295 762.3089 815.1537 823.6831 840.4616 849.2259 858.4106 884.6369 924.3095 933.6126 960.4013 974.8081 981.2879 986.8654 990.7782 992.0738 996.4725 1000.8453 1025.3104 1027.3355 1074.4101 1084.8405 1091.5800 1126.9111 1172.9953 1173.9012 1185.7499 1189.7341 1190.5535 1206.6612 1222.2390 1239.3006 1245.8455 1290.2844 1304.9363 1331.3192 1344.5448 1352.9452 1385.5807 1389.7417 1442.0695 1445.0083 1460.9451 1474.8738 1480.6284 1485.0369 1594.3384 1597.9630 1609.1145 1614.8910 1652.1413 1679.5450 3033.8566 3054.2348 3107.7638 3118.1744 3125.6504 3127.4338 3130.8416 3139.5220 3141.2792 3150.4904 3151.7960 3164.2920 3166.9689 3527.1163 3571.4891
redmass: 3.7505 6.1237 4.9807 4.6004 6.3695 8.6005 10.1980 6.0944 5.8558 5.9747 5.3661 5.0968 7.1314 5.9276 6.1733 3.3665 4.9809 3.3210 2.7828 2.8203 3.8205 3.4550 3.3546 2.7131 2.7813 1.4355 3.9465 2.6097 4.4062 4.5486 4.9717 3.9838 4.1195 1.8263 2.3278 2.2591 2.0880 3.5073 4.9727 3.7107 1.3300 1.2516 4.5336 1.5358 1.4975 2.7542 1.3961 1.5714 2.5917 5.9169 4.8463 1.3339 1.3445 2.3176 2.2194 2.0772 1.7801 1.5300 4.0637 1.0542 1.0738 2.4976 1.1471 1.1447 2.4733 2.8147 1.1596 1.4012 2.0668 1.4457 1.2541 1.2572 1.3321 7.9325 5.1728 2.1810 2.1166 1.1439 1.9022 2.1844 2.2759 6.0784 6.0980 6.0401 6.0443 9.6668 9.3502 1.0586 1.0847 1.1072 1.0866 1.0848 1.0873 1.0877 1.0921 1.0922 1.0963 1.0966 1.1016 1.1017 1.0644 1.0777
irintensity: 0.3412 0.1445 0.1175 0.3299 3.4558 1.4932 4.3627 1.2599 1.3428 0.9866 1.6942 0.9190 8.8769 4.2128 1.8732 2.8939 2.8240 13.0157 0.7001 0.0311 15.5497 3.7328 17.1455 41.9641 98.6381 66.9323 13.5650 76.2230 21.5168 38.1880 5.0691 34.8003 1.2446 103.0076 56.2263 23.0372 74.5266 8.8965 2.7073 11.1068 0.9650 0.1892 87.5627 7.9932 9.4831 94.1014 0.2578 23.9977 93.6760 8.5090 40.6537 0.9570 2.5623 4.3104 2.9930 78.2297 122.4019 15.8593 55.4965 0.0415 1.0213 61.5784 3.8574 0.6416 172.0409 22.3625 6.9878 16.6976 53.9856 30.2409 2.8156 9.2955 16.4059 0.5155 2.2713 9.8752 12.7181 12.4045 465.9738 38.9742 29.9284 1.9571 2.0501 2.9082 0.5564 220.7058 247.9257 37.6608 6.1722 6.2272 5.9099 1.5831 2.3680 0.0826 19.7270 13.9602 23.8154 31.7422 21.4795 19.6776 32.9220 70.3769
temp: 298.150 k
press: 1.00000 atm
elementType: 8 8 8 8 7 6 6 6 6 6 6 6 6 6 6 6 6 6 6 6 6 1 1 1 1 1 1 1 1 1 1 1 1 1 1 1
symmnumber: 1
zpe: 730156.7 jmol-1
zpe.correction: 0.278102 hartree
zpe.thermalcorrener: 0.296163 hartree
zpe.thermalcorrenthalpy: 0.297107 hartree
zpe.thermalcorrgfe: 0.228350 hartree
zpe.sumelectzpe: -972.867173 hartree
zpe.sumelectthermal: -972.849112 hartree
zpe.sumelectthermalent: -972.848168 hartree
zpe.sumelectthermalfe: -972.916926 hartree
dipole: 0.6038 0.4128 2.9941
dipole: 3.0822
quadrupole: -121.0086 -106.8457 -116.5502
quadrupole: -1.7455 -2.8435 -6.3386
quadrupole: -6.2071 7.9558 -1.7487 -1.7455 -2.8435 -6.3386
hfenergy: -973.1452752 hartree
pointgroup: C01 [X(C16H15N1O4)]
dipole: -0.3386357 -0.1434224 -1.155514 debye
polarizability: 188.4321391|3.3445214|201.7096582|26.2096533|-5.9442475|155.9799739 unknown
InChI: InChI=1S/C16H15NO4/c18-15(19)14(13-9-5-2-6-10-13)17-16(20)21-11-12-7-3-1-4-8-12/h1-10,14,17-18H,11H2
charge 0 multiplicity 1
36 atoms
O  -1.455114 -1.817811 0.535413
O  2.744438 -2.811126 -1.054436
O  4.317627 -2.186672 0.543649
O  -0.227264 -0.434359 2.012689
N  0.777798 -1.565136 0.221388
C  2.120805 -1.045266 0.489529
C  2.42285 0.309567 -0.183344
C  3.022351 1.347571 0.56678
C  2.121765 0.517935 -1.551506
C  3.18427 -2.054607 0.046945
C  -2.714689 -1.475577 1.28155
C  -3.427714 -0.292556 0.662718
C  -0.287351 -1.194638 1.009713
C  3.319007 2.586662 -0.044254
C  2.415387 1.756845 -2.161263
C  3.017067 2.793694 -1.409659
C  -3.054924 1.03255 1.010358
C  -4.476965 -0.49327 -0.269508
C  -3.71871 2.134789 0.428703
C  -5.143634 0.609168 -0.84988
C  -4.764923 1.926468 -0.50123
H  2.23408 -0.919165 1.580284
H  0.631358 -2.204772 -0.560542
H  3.247614 1.191049 1.628065
H  1.650425 -0.28151 -2.134744
H  -2.438212 -1.281558 2.332366
H  -3.308672 -2.399647 1.201843
H  3.777577 3.388655 0.544513
H  2.175621 1.915073 -3.21864
H  3.244343 3.75521 -1.883355
H  -2.237914 1.186643 1.724322
H  -4.770303 -1.514896 -0.541804
H  -3.423609 3.154161 0.701535
H  -5.955053 0.443033 -1.567391
H  -5.281688 2.783008 -0.948973
H  3.467658 -3.425814 -1.351534
