program: Gaussian 09
title: 000007931
version: EM64L-G09RevD.01
frameworkgroup: C1[X(C7H7Cl)]
method: RPBEPBE
basis: SDD
operation: Freq
keyword: #pfreq=noraman
keyword: PBEPBE/SDD
title: #p freq=noraman PBEPBE/SDD
converged: YES YES NO NO
title: Mulliken charges:
elementType: Cl C C C C C C C H H H H H H H
charge: -0.072494 0.462069 -0.365951 -0.398547 -0.797981 -0.064954 -0.194446 -0.242798 0.257424 0.234953 0.228706 0.239778 0.226567 0.230919 0.256755
chargesum: 0.00000
title: Mulliken charges with hydrogens summed into heavy atoms:
elementType: Cl C C C C C C C
charge: -0.072494 0.462069 -0.108528 -0.163593 -0.102930 -0.064954 0.036473 0.013958
polarizability: 1.12464458e+02 -1.57605191e+00 8.91607755e+01 -2.11245038e-01 -1.51710939e-01 3.74230274e+01
1716.lowfreq: -28.4185 -4.9334 -0.0017 -0.0013 -0.0011 2.0594 11.0964 170.0987 210.1875
frequency: -24.1624 170.0976 210.1872 218.1145 367.0347 389.0465 431.5409 510.0154 522.5598 665.9306 685.4450 780.0810 832.6812 875.7359 903.0363 976.9914 982.4018 991.1377 1046.7736 1073.0790 1095.2954 1176.9497 1218.2486 1290.9251 1371.7390 1398.0367 1414.0372 1466.1189 1471.4889 1474.1254 1577.2198 1609.8051 2977.7272 3059.7567 3088.9448 3128.0159 3148.8838 3151.9379 3174.5706
redmass: 1.0205 4.8243 3.1812 4.7971 3.5021 7.1687 2.8769 4.7780 4.0756 7.0148 2.4469 1.3296 5.1710 1.3264 1.3495 1.3455 3.6801 1.6828 1.5567 2.1631 1.4638 1.0932 2.5372 1.3125 7.6766 1.2217 2.5477 2.2376 1.0606 1.1731 5.9169 6.7636 1.0386 1.0951 1.1000 1.0874 1.0932 1.0931 1.0975
irintensity: 0.5599 1.2483 2.0369 0.4455 3.3348 4.1457 7.2502 0.7463 0.2783 13.7700 21.3802 61.1536 38.1625 7.1958 2.5937 0.3224 7.7703 1.2460 17.2760 22.7777 2.6376 1.1827 11.0035 0.0539 0.7645 12.7223 8.9030 17.9228 15.4427 38.1748 39.6840 33.6150 27.3016 21.0710 17.3680 7.4879 19.0284 2.6469 6.3059
temp: 298.150 k
press: 1.00000 atm
elementType: 17 6 6 6 6 6 6 6 1 1 1 1 1 1 1
symmnumber: 1
zpe: 304603.4 jmol-1
zpe.correction: 0.116017 hartree
zpe.thermalcorrener: 0.122710 hartree
zpe.thermalcorrenthalpy: 0.123654 hartree
zpe.thermalcorrgfe: 0.084609 hartree
zpe.sumelectzpe: -730.429134 hartree
zpe.sumelectthermal: -730.422441 hartree
zpe.sumelectthermalent: -730.421497 hartree
zpe.sumelectthermalfe: -730.460542 hartree
dipole: -2.4722 0.3976 0.0631
dipole: 2.5048
quadrupole: -52.5070 -47.6909 -57.6498
quadrupole: 2.1629 -0.1265 -0.0363
quadrupole: 0.1089 4.9250 -5.0339 2.1629 -0.1265 -0.0363
hfenergy: -730.5451512 hartree
pointgroup: C01 [X(C7H7Cl1)]
dipole: -0.9456132 0.2764831 0.0228439 debye
dipolederiv: -0.7199074 0.2605055 -0.0025713 0.2964038 -0.2784886 0.0004053 -0.00114 -0.0015546 -0.0841232 0.3346819 0.1788969 -0.0142747 0.1378516 0.1669301 -0.0097293 -0.066301 -0.0403077 -0.0168812 -0.4469128 -0.0180471 0.0012713 0.0698581 -0.0410919 -0.0063175 0.0092058 -0.0008617 -0.1412214 -0.0560046 -0.097547 -0.0026812 -0.1919559 -0.1383239 0.005644 0.0043163 0.0078664 -0.1874652 -0.0886455 -0.0995434 0.0118469 -0.0939382 -0.0056975 0.0070312 0.0930998 0.0571394 0.0606664 1.038013 -0.3890366 0.001121 -0.4509577 0.4008167 0.0036598 0.0046547 0.0059312 -0.0419267 0.1120155 -0.0383132 0.00278 0.0323404 0.1241189 -0.0041111 0.0073567 0.0017211 -0.1330095 -0.2512345 0.1497347 0.0042236 0.1611928 -0.180584 0.0024576 0.0014726 -0.0002098 -0.140611 0.1000644 -0.0001813 -0.0036856 0.0009403 -0.0541787 -0.0015286 -0.0037309 -0.0065536 0.1611779 -0.088295 0.0864344 -0.0034253 0.0684771 0.0558429 -0.0027116 -0.0083549 0.0003106 0.1585879 0.0585939 0.0473707 0.0366792 -0.0254609 -0.0830345 -0.1008238 -0.0212673 -0.1090471 0.0574449 0.0185859 -0.0588313 0.0416829 -0.0638416 0.0744358 0.0390419 0.0824472 0.0608443 -0.094585 -0.0668815 0.0355311 -0.069726 0.1084444 0.018316 0.0683221 -0.0964745 0.0264658 0.0705228 0.0689773 0.0155809 -0.0015096 0.0107773 -0.1196356 -0.0004829 -0.0032702 -0.0002491 0.1580217 -0.0130507 -0.0725545 -0.0017312 -0.0601317 0.0605744 -0.000857 -0.0020142 -0.0014953 0.1734015 unknown
polarizability: 111.7128112|-4.4098112|89.9133004|-0.0569447|-0.0834072|37.4221491 unknown
InChI: InChI=1S/C7H7Cl/c1-6-3-2-4-7(8)5-6/h2-5H,1H3
charge 0 multiplicity 1
15 atoms
Cl 2.823664 -1.079123 0.004667
C  -1.238278 -0.390233 -0.017022
C  0.032258 -1.023981 -0.013528
C  -1.289663 1.028189 -0.012999
C  -2.509453 -1.22205 0.001253
C  1.199306 -0.238226 0.001966
C  -0.103919 1.796572 0.002332
C  1.163238 1.169035 0.010602
H  0.106032 -2.116551 -0.024076
H  -2.263752 1.531136 -0.024112
H  -2.377362 -2.17817 -0.534725
H  -2.80694 -1.46587 1.039767
H  -3.351931 -0.680407 -0.463084
H  -0.158588 2.890783 0.003727
H  2.088188 1.752596 0.019432
