program: Gaussian 09
title: 000087818
version: EM64L-G09RevD.01
frameworkgroup: C1[X(C19H28N2O5S)]
method: RPBEPBE
basis: SDD
operation: Freq
keyword: #p
keyword: freq=noraman
keyword: PBEPBE/SDD
title: #p freq=noraman PBEPBE/SDD
converged: YES YES NO NO
title: Mulliken charges:
elementType: S O O O O O N N C C C C C C C C C C C C C C C C C C C H H H H H H H H H H H H H H H H H H H H H H H H H H H H
charge: 0.155581 -0.263524 -0.296985 -0.424764 -0.219037 -0.327707 -0.384542 -0.404516 -0.471365 -0.002227 -0.250346 0.217797 -0.722187 -0.713195 -0.146373 -0.349051 -0.722786 0.137145 0.314874 -0.440725 0.486676 -0.849351 -0.373528 -0.397114 -0.238471 -0.227233 -0.235350 0.223879 0.234395 0.196980 0.285031 0.208434 0.216116 0.227208 0.209642 0.215372 0.215757 0.299070 0.329845 0.393997 0.261175 0.254791 0.271718 0.271214 0.223392 0.247323 0.390150 0.254833 0.271279 0.263170 0.251279 0.233469 0.238212 0.229070 0.231501
chargesum: 0.00000
title: Mulliken charges with hydrogens summed into heavy atoms:
elementType: S O O O O O N N C C C C C C C C C C C C C C C C C C C
charge: 0.155581 -0.263524 -0.296985 -0.034613 -0.219037 -0.327707 -0.054697 -0.010518 -0.013091 0.194753 0.034685 0.217797 -0.070430 -0.072424 0.152697 0.166915 -0.179855 0.137145 0.314874 0.029989 0.486676 -0.060069 -0.122248 -0.163645 -0.000259 0.001837 -0.003849
polarizability: 2.87314756e+02 -7.10247293e+00 2.59096219e+02 1.42719263e+01 -1.04928755e+00 2.05431558e+02
1716.lowfreq: -11.3765 -0.0012 -0.0012 0.0009 2.6417 5.2708 13.6031 19.7120 27.4546
frequency: 13.2445 18.0440 27.1922 33.6374 34.4040 36.2950 40.7196 48.5326 51.1580 60.4419 74.5039 80.2369 85.0045 97.9051 107.5289 125.6020 135.1972 137.5574 144.6019 195.6361 199.9058 208.1324 213.0339 220.1172 236.3530 249.1756 266.7706 282.7766 294.4591 303.5409 305.7354 323.1464 337.8337 391.0166 405.9672 414.5193 430.0492 460.5478 495.5265 524.3183 532.8854 546.9601 561.4280 571.8181 616.9252 618.0191 648.6096 667.0017 685.1997 687.3053 694.7813 708.1701 735.9213 743.9170 746.4697 760.5035 766.5986 810.4881 830.3247 840.0596 849.7270 860.4881 867.1738 901.8260 914.5678 933.3089 934.8904 945.3228 957.5186 957.8626 961.5338 974.1311 980.4559 985.7242 990.3608 1004.1444 1015.1935 1025.8326 1028.6658 1057.8464 1084.8529 1092.3466 1102.8053 1108.4440 1142.7275 1156.6034 1173.2724 1178.8069 1182.9610 1189.3203 1193.5249 1204.8009 1210.0963 1220.9809 1229.7958 1253.4841 1268.7315 1274.7519 1284.3535 1292.3743 1308.4848 1325.7725 1328.3767 1335.2797 1335.5858 1345.7130 1350.8838 1352.3270 1356.6353 1380.2240 1386.4854 1398.1413 1440.4985 1442.7131 1450.4371 1452.4304 1459.9860 1467.7553 1469.4359 1471.2063 1475.8247 1482.6537 1484.0559 1488.3034 1489.7434 1504.3093 1595.5466 1607.5039 1615.9855 1626.8429 1666.5597 2963.2820 2968.8869 2971.6417 2989.2940 3002.8872 3013.2943 3015.7769 3016.0872 3021.6462 3027.4213 3049.5101 3061.1981 3068.9585 3069.1452 3074.1251 3075.2264 3083.1014 3098.5876 3109.0984 3118.6421 3120.6319 3130.2934 3132.9498 3147.7869 3164.3013 3424.1715 3522.3771 3557.9086
redmass: 5.6742 4.2163 3.1391 5.1409 8.0852 4.2734 5.8603 5.0592 5.0360 4.7425 4.3540 4.5472 7.3709 3.8352 1.9526 3.8986 1.6992 5.6293 3.7263 2.9866 2.6824 1.2570 3.6529 1.9191 2.6504 2.4412 4.5839 4.8884 4.6827 3.0615 3.7171 2.4609 4.6350 2.3629 2.8318 2.0787 4.3386 4.1030 3.1597 4.0455 3.4975 1.3650 3.4287 3.2495 4.4100 2.1215 4.0580 4.8323 3.9267 5.6577 8.1697 1.8276 1.5949 1.7260 3.0598 2.0275 2.3271 2.7777 3.6215 2.6664 2.6847 1.3462 3.1272 2.8703 1.1899 1.5197 2.7737 2.0610 1.4640 1.8083 1.7522 1.1964 2.5624 1.3912 5.7946 1.3294 2.0438 2.1155 2.1461 3.3797 1.7957 1.5321 3.7142 2.6103 2.5272 2.4399 1.0543 1.7821 1.2210 1.2043 1.5183 1.2813 1.4748 1.4286 2.3827 1.6312 1.2528 1.3426 1.3258 1.3562 1.4673 1.3737 1.4527 1.3872 1.4780 1.3017 1.2450 1.3023 1.5996 1.2126 7.9331 1.2169 2.1319 1.0966 1.0635 1.1945 1.0707 1.1034 1.0991 1.0933 1.3804 1.0586 1.1647 2.1711 1.0700 1.8316 6.0394 7.9012 6.1507 6.9726 9.1224 1.0827 1.0360 1.0361 1.0615 1.0294 1.0655 1.0698 1.0583 1.0847 1.0636 1.0996 1.0996 1.0990 1.0994 1.0989 1.1041 1.1076 1.1057 1.0910 1.1055 1.0870 1.1026 1.0900 1.0953 1.1013 1.0806 1.0643 1.0777
irintensity: 0.0121 0.0244 0.0228 0.4291 1.8438 1.5222 1.4462 1.3519 0.3055 0.1689 5.7958 3.0325 4.3920 1.7510 3.3665 0.4476 2.6407 4.2097 4.9676 4.6864 1.3323 1.0974 0.6985 2.5178 2.9024 13.0021 11.9834 1.9077 5.7295 3.4519 1.0051 0.6317 2.7396 2.8171 0.2535 0.7220 8.4482 8.4961 3.8451 12.3505 56.2131 134.3223 26.0789 1.6400 24.5643 95.9536 12.4431 46.8995 20.5944 2.9281 25.0323 49.1309 131.3791 36.9602 28.3344 66.8269 33.2881 1.3961 20.1863 12.8931 19.0105 1.8208 20.7829 7.5447 6.5129 12.6688 14.7893 53.4851 8.0983 21.9410 2.4739 3.2283 93.6469 2.4075 0.2003 1.4020 84.0245 25.5720 78.2152 29.0276 100.1006 7.1200 23.0053 9.0234 13.0849 20.3225 0.8190 12.2331 17.4181 27.3532 129.4563 12.1519 63.4937 32.4578 10.8791 73.9943 3.9171 5.9687 12.8186 14.0124 16.9054 11.6329 21.0805 22.8208 12.6244 4.3947 6.9394 0.8212 3.3793 18.5248 1.0614 17.7512 13.0280 1.3395 12.1703 98.6946 11.9277 55.8682 45.0608 27.8434 162.1296 12.2470 19.4478 22.2255 21.6016 319.5414 1.5947 52.8684 1.5790 298.0687 240.2485 20.3484 35.1723 27.2601 13.9686 17.5481 3.1610 12.7158 31.7659 3.6033 14.2622 14.9741 14.8485 68.2851 35.0414 74.5129 0.5092 13.1682 18.1369 1.5039 17.1912 4.7546 10.5343 7.3495 27.3471 27.1109 115.4606 34.1481 33.0968
temp: 298.150 k
press: 1.00000 atm
elementType: 16 8 8 8 8 8 7 7 6 6 6 6 6 6 6 6 6 6 6 6 6 6 6 6 6 6 6 1 1 1 1 1 1 1 1 1 1 1 1 1 1 1 1 1 1 1 1 1 1 1 1 1 1 1 1
symmnumber: 1
zpe: 1176941.7 jmol-1
zpe.correction: 0.448273 hartree
zpe.thermalcorrener: 0.478663 hartree
zpe.thermalcorrenthalpy: 0.479608 hartree
zpe.thermalcorrgfe: 0.381506 hartree
zpe.sumelectzpe: -1622.475399 hartree
zpe.sumelectthermal: -1622.445010 hartree
zpe.sumelectthermalent: -1622.444065 hartree
zpe.sumelectthermalfe: -1622.542167 hartree
dipole: 1.4452 -4.0556 -1.5864
dipole: 4.5884
quadrupole: -163.7491 -174.2596 -168.0355
quadrupole: 1.6173 8.3965 -6.5124
quadrupole: 4.9323 -5.5782 0.6459 1.6173 8.3965 -6.5124
hfenergy: -1622.9236729 hartree
pointgroup: C01 [X(C19H28N2O5S1)]
dipole: -1.3527982 -0.9879321 0.6728454 debye
polarizability: 285.6092971|-11.1300976|261.7516151|8.9974639|-6.4897609|204.4816201 unknown
InChI: InChI=1S/C19H28N2O5S/c1-13(2)11-16(17(22)20-15(18(23)24)9-10-27-3)21-19(25)26-12-14-7-5-4-6-8-14/h4-8,13,15-16,20-21,23H,9-12H2,1-3H3
charge 0 multiplicity 1
55 atoms
S  0.270415 3.610542 -1.14845
O  2.865226 -1.090427 -1.632572
O  -1.729976 -0.412677 0.837806
O  3.673452 1.287502 2.491396
O  4.973152 2.701252 1.182989
O  0.27233 -0.444285 2.096744
N  0.047283 -1.626518 0.088315
N  2.701886 -0.092194 0.466449
C  1.519335 -3.458113 -0.733221
C  0.614184 -4.619233 -0.244381
C  1.427396 -2.164588 0.096056
C  2.405893 -1.080419 -0.447556
C  0.967612 -5.071186 1.193051
C  0.716846 -5.80763 -1.230004
C  3.505596 1.070615 0.071727
C  2.682615 2.100485 -0.778804
C  1.471147 2.671468 -0.023251
C  4.145648 1.769962 1.264041
C  -0.409137 -0.807253 1.090805
C  -2.366341 0.443114 1.904385
C  -3.436903 1.29005 1.262858
C  -0.45938 2.15675 -2.103402
C  -3.102229 2.506495 0.613453
C  -4.794783 0.886607 1.314474
C  -4.109039 3.300138 0.021664
C  -5.804165 1.680882 0.725658
C  -5.462418 2.890317 0.077208
H  2.575862 -3.788879 -0.719859
H  1.299192 -3.215761 -1.791549
H  -0.439835 -4.2690 -0.239921
H  1.684807 -2.359605 1.153333
H  2.025376 -5.393826 1.251852
H  0.337687 -5.926422 1.499659
H  0.814053 -4.265356 1.933855
H  1.751275 -6.200619 -1.262971
H  0.438374 -5.507028 -2.257393
H  0.051285 -6.635876 -0.92469
H  4.325309 0.714243 -0.581551
H  -0.562527 -1.811258 -0.710158
H  2.245483 -0.104713 1.389864
H  2.360716 1.555286 -1.683139
H  3.355945 2.915302 -1.098064
H  1.774218 3.415733 0.733893
H  0.89714 1.875522 0.48267
H  -2.784106 -0.24711 2.658515
H  -1.565105 1.041679 2.371421
H  4.098057 1.790671 3.237576
H  -1.255184 2.576875 -2.737983
H  -0.898397 1.426248 -1.404655
H  0.304167 1.680879 -2.737881
H  -2.057191 2.840329 0.563472
H  -5.061632 -0.051594 1.816545
H  -3.837278 4.238557 -0.473993
H  -6.850848 1.360778 0.774517
H  -6.243886 3.509991 -0.376904
