program: Gaussian 09
title: 000087136
version: EM64L-G09RevD.01
frameworkgroup: C1[X(C12H16O2)]
method: RPBEPBE
basis: SDD
operation: Freq
keyword: #pfreq=noraman
keyword: PBEPBE/SDD
title: #p freq=noraman PBEPBE/SDD
converged: YES YES NO NO
title: Mulliken charges:
elementType: O O C C C C C C C C C C C C H H H H H H H H H H H H H H H H
charge: -0.444474 -0.253126 0.121343 0.543343 -0.698887 -0.698875 -0.746855 -0.556148 -0.510278 0.470159 0.241693 -0.574630 -0.818278 0.082438 0.221702 0.209162 0.222467 0.222584 0.209176 0.221656 0.220190 0.216148 0.216097 0.254927 0.276752 0.276972 0.230847 0.230514 0.230892 0.382489
chargesum: 0.00000
title: Mulliken charges with hydrogens summed into heavy atoms:
elementType: O O C C C C C C C C C C C C
charge: -0.061985 -0.253126 0.121343 0.543343 -0.045554 -0.045459 -0.094421 -0.301221 -0.233526 0.470159 0.241693 -0.297657 -0.126025 0.082438
polarizability: 1.73322498e+02 1.82600752e+00 1.56576384e+02 1.34783617e-03 2.21393300e-03 8.40985000e+01
1716.lowfreq: -0.0009 -0.0008 -0.0008 4.5670 10.2857 10.9074 41.3647 45.4772 58.7692
frequency: 41.0285 45.4496 58.7657 101.5566 127.7989 168.2570 202.1031 214.2371 217.8888 262.1249 271.3036 308.0882 308.5127 314.3652 348.7813 382.9439 393.5309 425.5444 470.8362 513.5285 533.4852 553.2301 581.0468 607.9079 610.0389 708.8037 740.2044 778.3777 876.3685 903.3125 916.3008 919.3653 930.4930 933.9986 943.4062 950.8696 987.4550 1001.4970 1024.1033 1025.0318 1053.3256 1053.9341 1137.6774 1148.5829 1205.7077 1212.0640 1225.0902 1274.1574 1293.2091 1336.7778 1373.4575 1375.7951 1387.4880 1400.2471 1403.5367 1425.3722 1445.9930 1458.5328 1468.1371 1470.5784 1472.3980 1478.4425 1485.4874 1488.2479 1498.0596 1600.5147 1613.0746 1643.0359 2971.8985 2972.9382 2977.7506 2978.2079 3055.6524 3067.8397 3067.9998 3069.6091 3076.5867 3078.1396 3081.1982 3089.2659 3143.4571 3150.4445 3166.1510 3529.9892
redmass: 2.7302 1.1253 6.3479 3.6084 4.8371 3.7477 3.1568 1.5607 1.5242 1.0937 2.8926 3.1659 1.5019 1.5545 3.2868 2.4293 4.3496 3.4656 2.9872 3.3561 3.3085 4.8643 2.2253 1.6713 4.3028 2.4788 4.1432 3.9657 4.4544 1.5438 3.6140 1.6561 1.6488 1.3994 1.2343 1.4183 3.6996 1.8475 1.4028 1.3886 2.4387 1.5778 1.4066 1.6193 3.0368 2.4757 2.3318 2.4779 1.2600 4.1115 1.1836 1.2654 5.4146 1.2562 1.2277 2.9688 2.3867 1.0507 1.0481 1.0805 1.0458 1.0800 1.2489 1.0500 1.0743 6.1665 5.8515 8.4699 1.0349 1.0345 1.0362 1.0371 1.0976 1.1004 1.0999 1.1005 1.0986 1.0996 1.0992 1.0986 1.0898 1.0923 1.0912 1.0641
irintensity: 0.0605 0.8322 0.8424 1.3433 0.1219 0.2407 1.6849 0.4690 0.8331 0.1203 0.2091 1.9958 0.3956 0.1603 2.3424 0.1216 3.0858 4.5095 5.7946 0.5201 5.4973 1.8897 40.7283 105.3973 43.7884 0.8899 38.9016 0.5996 15.1491 13.5028 50.1434 3.0050 3.2436 4.4787 0.0181 6.7627 10.5400 27.4758 4.0979 0.1407 198.0101 12.9643 60.2560 40.1235 6.3245 14.0162 10.8369 35.7085 0.4647 78.7332 18.5997 29.1305 17.4443 11.7519 9.1527 1.3100 23.7973 0.2779 0.6413 6.5287 13.7498 13.3308 13.9057 12.9778 28.9506 78.0900 27.5019 250.5222 29.4053 33.3800 39.1341 19.4088 19.0157 0.5845 2.2786 24.7744 118.1747 30.4614 47.6465 16.9396 9.4737 3.8804 2.0606 40.4472
temp: 298.150 k
press: 1.00000 atm
elementType: 8 8 6 6 6 6 6 6 6 6 6 6 6 6 1 1 1 1 1 1 1 1 1 1 1 1 1 1 1 1
symmnumber: 1
zpe: 655601.4 jmol-1
zpe.correction: 0.249705 hartree
zpe.thermalcorrener: 0.264598 hartree
zpe.thermalcorrenthalpy: 0.265542 hartree
zpe.thermalcorrgfe: 0.207811 hartree
zpe.sumelectzpe: -616.292337 hartree
zpe.sumelectthermal: -616.277445 hartree
zpe.sumelectthermalent: -616.276501 hartree
zpe.sumelectthermalfe: -616.334231 hartree
dipole: 2.8294 0.2164 0.0003
dipole: 2.8377
quadrupole: -89.7408 -73.3055 -86.6166
quadrupole: 3.5606 -0.0018 0.0016
quadrupole: -6.5198 9.9155 -3.3956 3.5606 -0.0018 0.0016
hfenergy: -616.5420428 hartree
pointgroup: C01 [X(C12H16O2)]
dipole: 1.1146025 0.0630511 0.0087494 debye
polarizability: 173.383078|1.49113|156.5101728|0.6856423|0.1742211|84.1041312 unknown
InChI: InChI=1S/C12H16O2/c1-8-5-9(11(13)14)7-10(6-8)12(2,3)4/h5-7,13H,1-4H3
charge 0 multiplicity 1
30 atoms
O  -2.395473 -2.403809 -0.028963
O  -3.842714 -0.590904 -0.036467
C  2.417944 -0.643989 0.011494
C  1.024244 0.028935 0.002216
C  2.567585 -1.533724 -1.259641
C  2.54882 -1.536958 1.282437
C  3.575642 0.38745 0.021123
C  0.849536 1.434318 0.004011
C  -0.141889 -0.779634 -0.008324
C  -0.43506 2.045703 -0.004278
C  -1.428492 -0.194219 -0.016813
C  -1.575329 1.217906 -0.01475
C  -0.562902 3.559461 -0.001875
C  -2.662901 -1.021378 -0.028142
H  2.489619 -0.924644 -2.178935
H  3.55347 -2.035487 -1.258635
H  1.788895 -2.315819 -1.305042
H  1.768096 -2.317619 1.31514
H  3.533769 -2.04042 1.293778
H  2.459226 -0.929831 2.201963
H  4.543506 -0.14648 0.027277
H  3.55789 1.034666 -0.875448
H  3.545313 1.032267 0.919093
H  1.728436 2.088007 0.012066
H  -0.069413 -1.870819 -0.010127
H  -2.585161 1.64221 -0.021455
H  -0.070206 4.005453 -0.886283
H  -1.619829 3.875091 -0.010385
H  -0.085693 4.001338 0.893019
H  -3.263328 -2.889672 -0.036851
