program: Gaussian 09
title: 000087085
version: EM64L-G09RevD.01
frameworkgroup: C1[X(C10H12O2)]
method: RPBEPBE
basis: SDD
operation: Freq
keyword: #pfreq=noraman
keyword: PBEPBE/SDD
title: #p freq=noraman PBEPBE/SDD
converged: YES YES NO NO
title: Mulliken charges:
elementType: O O C C C C C C C C C C H H H H H H H H H H H H
charge: -0.262519 -0.259922 0.397072 0.293371 -0.489474 -0.412583 -0.388629 -0.814708 -0.241224 -0.233557 0.308586 -0.751323 0.230116 0.252940 0.231821 0.231525 0.240521 0.241081 0.225169 0.229507 0.228280 0.249477 0.250154 0.244321
chargesum: 0.00000
title: Mulliken charges with hydrogens summed into heavy atoms:
elementType: O O C C C C C C C C C C
charge: -0.262519 -0.259922 0.397072 0.293371 -0.006419 -0.180762 -0.157105 -0.107937 -0.011717 -0.005277 0.308586 -0.007371
polarizability: 1.51323418e+02 7.78558273e+00 1.10818998e+02 -8.80865752e+00 1.64901496e+00 7.35531557e+01
1716.lowfreq: -1.9562 -0.0004 -0.0002 0.0001 5.9477 11.6569 40.7975 42.6379 52.0567
frequency: 40.7741 42.6233 51.9967 72.1950 111.9821 157.8491 195.9994 226.1500 281.0543 321.6982 386.5703 422.1657 459.0509 507.2030 543.6992 565.4451 592.7266 618.7030 723.6679 741.9134 757.5983 803.3107 845.0074 876.5116 912.2330 948.7449 988.8771 989.7026 990.0157 995.4693 1041.4457 1042.3040 1052.6518 1121.6940 1175.4074 1192.8275 1197.6892 1222.4793 1242.3467 1292.7436 1351.6438 1379.6036 1383.6019 1401.4874 1437.6584 1453.8885 1455.1163 1463.4816 1477.4528 1488.0651 1490.8929 1589.7388 1616.7091 1645.6584 2978.3319 3006.7021 3014.6103 3056.9388 3082.3905 3088.1227 3099.2852 3116.9325 3121.8770 3140.1805 3141.0626 3162.0572
redmass: 1.8830 1.6474 4.2207 3.3285 1.0850 3.6037 4.2843 5.3921 4.1308 2.2363 2.8025 2.6652 3.1063 3.8243 4.3564 3.2633 4.9815 5.0392 3.4450 2.7407 1.5516 4.0158 3.5427 1.3863 5.0869 1.4634 1.5814 1.7579 1.4461 1.9228 1.5925 1.6523 1.9995 1.7565 1.0658 2.7473 2.4889 1.4183 2.0144 1.3526 1.3884 5.1644 1.2560 1.2348 2.1414 1.0624 1.0531 1.0938 1.1602 2.3396 1.1063 6.3927 6.3350 9.0295 1.0385 1.0379 1.0575 1.0952 1.1064 1.0997 1.0948 1.0865 1.0892 1.0933 1.1022 1.1007
irintensity: 1.3604 0.6071 0.9937 1.7063 1.0832 3.2090 4.4508 9.1664 1.3842 2.9665 0.8020 1.9292 11.8676 6.0427 2.7100 2.5813 7.1071 5.5186 0.8525 17.1745 77.4837 4.1191 2.5227 5.9262 107.6000 3.6112 0.4366 14.5007 8.7583 56.2269 11.4458 16.6248 3.8800 4.6041 2.4493 271.3451 61.4655 25.6451 2.5480 1.6283 5.1910 0.8196 54.2696 14.0159 1.8501 24.7722 17.1424 5.0098 27.4659 18.7023 25.4938 0.6486 1.6152 193.7932 21.8268 2.7258 25.0203 16.3021 21.8886 13.7767 7.5960 13.2395 2.8150 31.2494 9.8965 29.5999
temp: 298.150 k
press: 1.00000 atm
elementType: 8 8 6 6 6 6 6 6 6 6 6 6 1 1 1 1 1 1 1 1 1 1 1 1
symmnumber: 1
zpe: 510781.6 jmol-1
zpe.correction: 0.194546 hartree
zpe.thermalcorrener: 0.206779 hartree
zpe.thermalcorrenthalpy: 0.207724 hartree
zpe.thermalcorrgfe: 0.154548 hartree
zpe.sumelectzpe: -537.829196 hartree
zpe.sumelectthermal: -537.816963 hartree
zpe.sumelectthermalent: -537.816018 hartree
zpe.sumelectthermalfe: -537.869194 hartree
dipole: -0.8787 -0.4389 1.3827
dipole: 1.6961
quadrupole: -67.3297 -64.7995 -74.8724
quadrupole: -2.1072 6.1068 3.1967
quadrupole: 1.6709 4.2010 -5.8719 -2.1072 6.1068 3.1967
hfenergy: -538.023742 hartree
pointgroup: C01 [X(C10H12O2)]
dipole: -0.3217611 0.3162661 -0.4916686 debye
dipolederiv: -1.5652655 0.3867353 0.1027221 0.5108399 -0.5354413 0.0148674 0.3004962 -0.0014742 -0.4544754 -0.7380896 0.1296408 0.0467544 0.3496431 -0.5612365 0.1879904 -0.2290225 0.3262452 -0.72732 0.0132724 0.0040336 0.0311882 0.0587669 -0.1101566 -0.0211767 0.029501 -0.0616584 -0.1033574 0.0994721 -0.2297837 -0.0298605 -0.1318608 0.179111 0.027503 -0.0759568 0.0422101 -0.025825 0.8259117 -0.0134603 -0.0365661 0.1406633 0.2749232 0.0695557 -0.4197118 0.1438465 0.3264101 -0.0407375 0.0587735 0.0528603 -0.0344891 0.0534903 0.0545738 0.0608763 0.0567476 -0.1224504 -0.1250157 0.1552335 0.0549207 0.0749764 0.0095925 0.0635948 0.035084 0.0919548 -0.1354188 -0.0437494 0.1556439 0.0062785 0.0796012 -0.0315599 -0.009447 0.0265415 -0.0423242 0.023563 -0.0592243 -0.1086423 0.009729 -0.111359 0.0031146 0.0140992 -0.0039251 0.0167045 -0.1578496 0.074263 0.0041905 0.0711264 0.0223959 -0.0011584 0.039598 0.0683929 0.0370677 -0.1189255 1.5888428 -0.5153832 -0.2571975 -0.9217925 0.7487367 -0.2803655 0.0512011 -0.4042315 0.9088312 -0.2220257 -0.0112795 0.207313 -0.0145624 0.0066351 0.1037932 0.221629 0.0379784 -0.2161608 -0.0011776 0.0139418 0.028242 -0.0529354 -0.091672 -0.121087 0.0655149 -0.061765 0.0398709 0.0313042 0.0163454 -0.0427203 -0.0242499 0.0363001 0.1125984 0.0916778 0.021399 0.0276703 0.0611011 -0.0855905 -0.051797 -0.056296 -0.0654349 -0.0677643 -0.0410835 -0.0772253 0.1166921 0.0608204 -0.0356026 -0.0354868 -0.0753913 -0.0866411 -0.0763172 -0.0399549 -0.0684733 0.120682 -0.0059348 0.0546379 0.1086341 0.0364671 0.0438582 0.0338509 0.1307485 -0.0049635 -0.0319839 0.0324468 0.0542479 -0.0921056 0.0374446 0.073854 -0.032307 -0.1161284 0.0274489 -0.0264618 -0.0047756 -0.1559018 -0.0122082 -0.0576733 -0.0884229 -0.0137716 -0.0190629 -0.026935 0.1092625 -0.0024912 0.1077325 -0.0146596 0.1202682 -0.0451974 -0.0217807 -0.0198339 -0.0241842 0.1519936 -0.1179688 -0.0068928 -0.0756612 -0.0163285 0.0879938 -0.0218811 -0.0798799 -0.0188133 0.1314887 0.053526 -0.0728642 0.0185952 -0.0985189 -0.0089479 -0.0235301 -0.0066858 -0.0389596 0.096406 0.0491097 0.0104678 -0.1124064 0.039243 0.1222571 -0.0094605 -0.0644451 0.0092073 -0.0166499 0.0363853 0.0837764 0.0223054 0.1251475 -0.0139977 -0.0231361 0.0340275 0.0201975 0.0840082 unknown
polarizability: 148.5919738|-14.2983264|112.006746|6.0216292|7.9221354|75.0968512 unknown
InChI: InChI=1S/C10H12O2/c1-8-5-3-4-6-10(8)7-12-9(2)11/h3-6H,7H2,1-2H3
charge 0 multiplicity 1
24 atoms
O  1.681149 0.541817 -0.241783
O  3.01179 -1.004045 0.908099
C  -0.692779 0.444336 0.436692
C  -1.172066 -0.820768 -0.023698
C  0.726596 0.619746 0.921828
C  -1.569545 1.557015 0.469499
C  -2.525626 -0.920563 -0.431456
C  -0.266525 -2.036766 -0.109223
C  -2.915693 1.441496 0.060568
C  -3.395106 0.192884 -0.392852
C  2.791364 -0.301244 -0.105143
C  3.667711 -0.211688 -1.336352
H  0.876399 1.621947 1.357402
H  1.036036 -0.148332 1.653729
H  -1.190547 2.524967 0.82051
H  -2.902823 -1.888943 -0.78206
H  0.39509 -1.972641 -0.994549
H  0.394529 -2.136367 0.770292
H  -0.856916 -2.964284 -0.200873
H  -3.579815 2.311848 0.095595
H  -4.437862 0.084736 -0.71198
H  4.307213 0.687108 -1.266022
H  3.055876 -0.115534 -2.24717
H  4.31585 -1.098625 -1.395452
