program: Gaussian 09
title: 000007927
version: EM64L-G09RevD.01
frameworkgroup: C1[X(C6H4Br2)]
method: RPBEPBE
basis: SDD
operation: Freq
keyword: #pfreq=noraman
keyword: PBEPBE/SDD
title: #p freq=noraman PBEPBE/SDD
converged: NO NO NO NO
title: Mulliken charges:
elementType: Br Br C C C C C C H H H H
charge: 0.027353 0.027349 -0.152275 -0.174790 -0.174786 -0.191942 -0.191945 -0.198298 0.273964 0.256158 0.256159 0.243052
chargesum: 0.00000
title: Mulliken charges with hydrogens summed into heavy atoms:
elementType: Br Br C C C C C C
charge: 0.027353 0.027349 0.121689 -0.174790 -0.174786 0.064216 0.064215 0.044755
polarizability: 1.45408091e+02 6.91532711e-04 9.69190500e+01 -2.27571152e-03 -5.60620252e-04 3.15967806e+01
1716.lowfreq: -0.0002 0.0000 0.0003 6.7566 7.3584 12.6296 122.6444 138.8537 178.4997
frequency: 122.6444 138.8464 178.4987 271.5538 296.0873 339.9415 429.0540 512.9764 634.0756 673.1481 695.4441 778.5007 887.0574 904.6885 971.9102 978.8544 1048.7959 1072.7957 1094.4697 1177.8936 1275.8605 1360.9172 1390.7739 1436.1389 1565.1482 1568.6440 3146.5760 3165.7964 3172.5885 3178.0937
redmass: 23.0844 5.7935 4.4455 14.1438 5.3096 8.0240 3.0332 5.3584 7.0962 2.6509 8.6586 1.3212 1.3925 1.3566 6.7171 1.3389 5.6176 1.6807 1.7351 1.0789 1.2389 10.3716 2.4981 2.0898 6.6033 7.1130 1.0873 1.0931 1.0934 1.0994
irintensity: 0.0452 0.7965 0.0000 1.9330 2.7610 3.3326 8.3140 0.0000 1.1468 28.6750 86.4362 58.7632 15.1593 0.0000 13.9653 0.2939 31.5902 19.9771 1.5924 0.3273 2.4499 0.4152 17.7485 88.3900 111.1387 29.4587 3.3436 1.7271 0.4084 7.0460
temp: 298.150 k
press: 1.00000 atm
elementType: 35 35 6 6 6 6 6 6 1 1 1 1
symmnumber: 1
zpe: 206163.1 jmol-1
zpe.correction: 0.078523 hartree
zpe.thermalcorrener: 0.085858 hartree
zpe.thermalcorrenthalpy: 0.086803 hartree
zpe.thermalcorrgfe: 0.044074 hartree
zpe.sumelectzpe: -257.386144 hartree
zpe.sumelectthermal: -257.378809 hartree
zpe.sumelectthermalent: -257.377865 hartree
zpe.sumelectthermalfe: -257.420594 hartree
dipole: 0.0000 -1.9045 0.0000
dipole: 1.9045
quadrupole: -66.4319 -56.0476 -68.8753
quadrupole: -0.0001 0.0000 -0.0001
quadrupole: -2.6470 7.7373 -5.0903 -0.0001 0.0000 -0.0001
hfenergy: -257.4646675 hartree
pointgroup: C01 [X(C6H4Br2)]
dipole: -0.0000621 0.7492957 -0.0000102 debye
dipolederiv: -0.5924689 -0.2439711 -0.0000137 -0.2962171 -0.2069072 0.0000068 -0.0000102 0.0000168 -0.0263006 -0.5925873 0.2439371 -0.0000068 0.2960866 -0.2068475 0.0000186 -0.0000161 -0.0000062 -0.0263058 -0.6913969 -0.0000339 -0.0000116 -0.0000109 -0.116191 -0.000005 -0.0000154 0.0000095 -0.0454375 1.0721133 0.4815021 0.0000179 0.4890093 0.3931878 0.0000037 0.0000296 -0.0000218 -0.1128728 1.0722364 -0.4814293 0.000025 -0.4889653 0.3930972 -0.0000142 0.0000304 -0.0000159 -0.1128669 -0.2861497 -0.2265931 -0.0000092 -0.1846848 -0.1919896 -0.0000023 0.0000033 -0.0000122 -0.1066659 -0.2862831 0.2265872 0.0000032 0.1846757 -0.1919623 0.0000047 -0.0000072 0.0000233 -0.1066658 0.1790971 0.0000032 0.0000055 0.0000379 0.080317 -0.0000083 0.0000088 -0.0000039 -0.1286427 0.1082572 0.0000051 -0.0000018 0.0000014 -0.0015993 0.0000029 -0.0000007 0.0000037 0.1653126 -0.013968 0.0682948 0.000004 0.0584916 0.070786 -0.0000029 -0.0000102 0.0000111 0.167792 -0.0138589 -0.068303 -0.0000103 -0.0584439 0.0707626 -0.0000049 -0.000005 -0.000009 0.1677914 0.0450088 0.0000009 -0.0000021 0.0000195 -0.0926536 0.0000008 -0.0000072 0.0000046 0.164862 unknown
polarizability: 145.4080908|0.0021161|96.9190501|0.0022757|-0.0005605|31.5967806 unknown
InChI: InChI=1S/C6H4Br2/c7-5-2-1-3-6(8)4-5/h1-4H
charge 0 multiplicity 1
12 atoms
Br -2.904213 -1.2684 -0.000022
Br 2.90432 -1.268064 0.000083
C  0.000036 -1.007051 0.00002
C  -1.211234 -0.28127 -0.000006
C  1.21122 -0.281123 0.000042
C  -1.23127 1.130075 -0.000021
C  1.231098 1.13022 0.000017
C  -0.000129 1.825922 -0.00001
H  0.000095 -2.100681 0.000033
H  -2.179507 1.675625 -0.000044
H  2.179267 1.675887 0.000029
H  -0.000183 2.920761 -0.000021
