program: Gaussian 09
title: 000087061
version: EM64L-G09RevD.01
frameworkgroup: C1[X(C6H6N4O2)]
method: RPBEPBE
basis: SDD
operation: Freq
keyword: #pfreq=noraman
keyword: PBEPBE/SDD
title: #p freq=noraman PBEPBE/SDD
converged: NO NO NO NO
title: Mulliken charges:
elementType: O O N N N N C C C C C C H H H H H H
charge: -0.251503 -0.243885 -0.410078 -0.356806 -0.081545 -0.403000 0.143603 0.064511 0.221822 0.119050 0.145424 -0.769754 0.338553 0.357448 0.366412 0.274789 0.242526 0.242435
chargesum: 0.00000
title: Mulliken charges with hydrogens summed into heavy atoms:
elementType: O O N N N N C C C C C C
charge: -0.251503 -0.243885 -0.071525 0.000641 -0.081545 -0.036589 0.143603 0.064511 0.221822 0.119050 0.145424 -0.010004
polarizability: 1.42894008e+02 -1.22543320e+00 1.07383676e+02 -1.96662271e-02 -3.94036928e-03 4.45465948e+01
1716.lowfreq: -0.0009 -0.0006 -0.0004 5.8525 9.1800 12.8797 55.5370 100.3525 153.3703
frequency: 55.4385 100.3523 153.3702 178.3911 207.3322 258.1884 330.8772 349.6316 388.5242 439.9073 504.3853 565.1978 612.5953 628.5470 651.3128 657.0277 676.2570 703.0055 723.1140 738.5552 765.5608 846.7612 952.8890 969.9666 997.6069 1047.4564 1101.9820 1205.2604 1218.6166 1272.6870 1301.5364 1351.0679 1363.2709 1400.2946 1426.1194 1468.0209 1469.2555 1482.7466 1543.0355 1577.5568 1665.9225 1672.6840 2988.8792 3065.5750 3126.3014 3528.4206 3569.3917 3586.8200
redmass: 1.0408 5.2771 6.6664 6.7955 4.2316 4.9179 8.5210 6.5561 4.5919 7.9513 7.3059 8.0592 1.8872 1.7853 5.0948 2.9099 1.2184 3.7410 6.1535 3.4059 3.2951 5.4557 4.1476 2.1022 2.7381 1.4850 5.5469 3.7060 3.3068 2.4594 3.2320 2.7488 2.0472 1.2724 2.7240 1.2197 1.0437 4.4652 4.4354 10.4630 8.5460 5.6299 1.0392 1.0982 1.0968 1.0770 1.0784 1.0822
irintensity: 0.2111 0.1699 1.2343 4.5795 6.8753 5.7089 14.8548 3.3103 6.2990 13.4389 22.7846 4.1170 13.1247 64.9587 7.2321 48.5667 72.2503 4.1913 0.3124 62.5761 125.4252 4.6960 5.0719 2.8433 1.9089 5.6291 53.7956 62.3389 13.1774 7.1985 119.1598 23.0922 54.0155 1.5030 0.0312 20.9406 19.3604 209.0181 6.4692 9.8250 518.5235 780.1290 19.2500 12.9153 3.3179 71.2659 91.5609 78.7171
temp: 298.150 k
press: 1.00000 atm
elementType: 8 8 7 7 7 7 6 6 6 6 6 6 1 1 1 1 1 1
symmnumber: 1
zpe: 340264.0 jmol-1
zpe.correction: 0.129600 hartree
zpe.thermalcorrener: 0.139434 hartree
zpe.thermalcorrenthalpy: 0.140378 hartree
zpe.thermalcorrgfe: 0.093860 hartree
zpe.sumelectzpe: -600.891439 hartree
zpe.sumelectthermal: -600.881604 hartree
zpe.sumelectthermalent: -600.880660 hartree
zpe.sumelectthermalfe: -600.927179 hartree
dipole: -5.4011 0.2267 0.0011
dipole: 5.4059
quadrupole: -65.4400 -77.5146 -69.2311
quadrupole: -1.9564 -0.0003 0.0006
quadrupole: 5.2886 -6.7860 1.4975 -1.9564 -0.0003 0.0006
hfenergy: -601.0210386 hartree
pointgroup: C01[X(C6H6N4O2)]
dipole: 2.1244191 -0.1015479 0.0004274 debye
dipolederiv: -0.5834403 -0.0815783 -0.0000397 -0.1633122 -1.3483871 -0.0000594 -0.0000426 -0.0001311 -0.3687832 -1.3675721 0.4079867 -0.0000827 0.4608454 -0.699505 0.0000339 -0.0002823 0.0001204 -0.3888349 -0.3215614 0.1601154 0.0000494 0.0780422 -0.5428591 -0.0000187 -0.0000461 0.0000207 -0.2095863 -1.2326452 0.3735907 -0.0001465 -0.2157812 -0.4662989 -0.0000576 -0.0001169 0.0000453 -0.3064086 -0.8733228 0.1442872 -0.0000701 0.122514 -0.3684788 0.0000371 -0.0000493 -0.0000022 -0.2594723 -0.7984715 0.4008121 -0.0000464 0.5775283 -1.0465613 0.0000847 -0.0000419 0.000013 -0.3654723 -0.4093879 -0.621301 -0.0001589 -0.5192322 -0.5741238 -0.0000938 -0.0001104 -0.0001276 -0.0354295 0.9789235 -0.4053099 0.0001049 -0.0628605 0.6027472 -0.0000035 0.0000871 -0.0000164 0.1022893 0.6346901 -0.0261546 0.0001428 -0.2120849 0.5665284 -0.0000434 0.0005677 0.0000788 0.0429422 1.4581076 0.0996916 0.0002084 0.1392239 1.7942713 0.0000829 0.0001966 0.0001139 0.2760816 2.014059 -0.4156165 0.0002049 -0.3388907 1.2765871 0.0000064 0.0003364 -0.0000561 0.3186518 -0.1772853 -0.0425339 -0.0000044 0.0891369 0.0210505 0.0001374 -0.0006978 -0.0000076 0.0687351 0.225874 -0.0399219 -0.0000169 -0.0044134 0.2319587 -0.0000071 -0.0000027 -0.0000327 0.3470126 0.1638986 -0.0030775 -0.0000226 0.0028478 0.2888344 0.0000003 -0.0000215 0.0000106 0.3515632 0.2199942 0.042771 -0.0000157 0.053387 0.1711921 -0.0000027 -0.000011 -0.0000046 0.34293 0.099209 0.0051047 -0.0000038 -0.0807687 -0.0434269 0.0002851 0.0002084 0.0002792 0.1352415 -0.0156277 0.0005094 -0.0339857 0.0367548 0.0685425 0.0960968 -0.0954914 0.0762567 -0.0260174 -0.0154417 0.0006248 0.033883 0.0370636 0.0679287 -0.0964782 0.0955174 -0.0765604 -0.0254425 unknown
polarizability: 142.8785508|-1.4318953|107.3991325|0.0196888|0.0038259|44.5465948 unknown
InChI: InChI=1S/C6H6N4O2/c1-2-7-3-4(8-2)9-6(12)10-5(3)11/h7,9-10H,1H3
charge 0 multiplicity 1
18 atoms
O  -0.919312 -2.72405 -0.000142
O  -3.279348 1.35262 -0.000335
N  1.679592 -0.937295 0.000357
N  -0.935257 1.458321 0.000115
N  1.546809 1.333418 0.000474
N  -2.040174 -0.644672 -0.00018
C  0.316439 -0.624232 0.00019
C  0.274635 0.778465 0.000273
C  2.389536 0.260677 0.000545
C  -0.862068 -1.45873 0.000014
C  -2.16278 0.770186 -0.000036
C  3.883504 0.337777 0.000857
H  2.060952 -1.88323 0.000293
H  -0.968342 2.479347 0.000103
H  -2.935038 -1.14478 -0.000387
H  4.182242 1.396647 -0.000677
H  4.318531 -0.144863 0.895466
H  4.319079 -0.147706 -0.891928
