program: Gaussian 09
title: 000087060
version: EM64L-G09RevD.01
frameworkgroup: C1[X(C6H4ClN2)]
method: RPBEPBE
basis: SDD
operation: Freq
keyword: #p
keyword: freq=noraman
keyword: PBEPBE/SDD
title: #p freq=noraman PBEPBE/SDD
converged: YES YES YES YES
title: Mulliken charges:
elementType: Cl N N C C C C C C H H H H
charge: 0.144847 0.012855 0.169982 0.419191 -0.297144 -0.297152 -0.109743 -0.109743 -0.153749 0.300560 0.300561 0.309769 0.309767
chargesum: 1.00000
title: Mulliken charges with hydrogens summed into heavy atoms:
elementType: Cl N N C C C C C C
charge: 0.144847 0.012855 0.169982 0.419191 0.003416 0.003409 0.200025 0.200024 -0.153749
polarizability: 1.84465427e+02 7.75331563e-04 7.25868053e+01 2.05479067e-03 -1.93337192e-04 3.03885814e+01
1716.lowfreq: -10.8114 -9.5727 -0.1894 -0.0016 0.0012 0.0014 83.5896 151.5564 229.1981
frequency: 83.5893 151.5564 229.1979 291.0656 338.7441 388.2641 443.4652 538.0587 542.2109 582.6736 627.0418 696.0365 767.3286 812.3697 835.8629 970.9579 975.9184 989.2462 1080.5420 1124.9368 1164.5902 1206.6579 1301.2677 1367.8941 1440.0520 1444.4121 1524.0209 1576.0989 2097.6497 3174.3958 3174.4695 3189.9443 3192.4023
redmass: 10.8029 10.7337 7.3231 6.2880 17.7909 2.9009 4.2940 5.1146 7.7256 7.9760 7.6825 4.1371 6.7505 1.2467 1.4700 1.3257 1.3617 3.5569 3.6115 1.3709 2.8243 1.3594 1.2758 3.7529 5.0108 1.9906 6.9747 5.8972 13.8775 1.0912 1.0906 1.0987 1.1002
irintensity: 0.4958 1.5062 0.0037 0.4624 10.3882 0.0000 12.7240 19.8884 0.5345 8.1206 1.5807 0.3050 5.2761 0.0000 87.4933 0.8707 0.0000 8.8396 125.7209 8.1109 112.4013 4.3550 0.0702 0.3614 35.7663 9.7346 3.3284 340.9300 413.2375 6.3180 0.1638 15.8411 0.3285
temp: 298.150 k
press: 1.00000 atm
elementType: 17 7 7 6 6 6 6 6 6 1 1 1 1
symmnumber: 1
zpe: 229222.0 jmol-1
zpe.correction: 0.087306 hartree
zpe.thermalcorrener: 0.094757 hartree
zpe.thermalcorrenthalpy: 0.095702 hartree
zpe.thermalcorrgfe: 0.054609 hartree
zpe.sumelectzpe: -799.662262 hartree
zpe.sumelectthermal: -799.654811 hartree
zpe.sumelectthermalent: -799.653867 hartree
zpe.sumelectthermalfe: -799.694959 hartree
dipole: -4.5561 0.0000 0.0000
dipole: 4.5561
quadrupole: -32.0983 -41.4162 -57.4382
quadrupole: -0.0001 0.0001 -0.0001
quadrupole: 11.5526 2.2347 -13.7873 -0.0001 0.0001 -0.0001
hfenergy: -799.7495681 hartree
pointgroup: C01 [X(C6H4Cl1N2)]
dipole: 1.7925094 0.0000194 0.0000117 debye
dipolederiv: -0.8384271 -0.000007 0.0000033 -0.0000088 0.0039796 -0.0000003 0.0000205 -0.0000003 0.0784993 2.3476761 0.0000417 -0.0000086 -0.0000893 0.0169136 -0.0000009 0.0001954 -0.0000011 0.2017122 -1.1136708 -0.0000561 0.0000371 0.0001174 0.1089875 0. -0.0001548 0. 0.1030154 -1.2459685 0.0000107 -0.0000315 -0.0000367 0.1798507 0.0000006 -0.0000732 0.0000002 0.0752 0.6066181 -0.1364271 0.0000089 0.4141071 0.0437067 0.0000073 0.000021 -0.0000016 -0.0487193 0.6066391 0.1364332 0.0000108 -0.414072 0.043708 -0.0000061 0.0000175 0.0000039 -0.0487163 -0.6679295 0.304619 -0.0000021 0.4179826 -0.0840473 0.0000015 0.0000082 -0.0000029 -0.0302459 -0.6679109 -0.304628 -0.0000047 -0.4180138 -0.0840539 -0.0000026 0.0000052 0.0000012 -0.0302476 1.6626378 0.0000102 -0.0000101 0.0000098 0.3648608 0.000002 -0.0000242 0.0000019 -0.0197293 0.0680179 0.0280881 -0.0000009 -0.0011224 0.1024554 0.0000008 -0.0000044 0.000002 0.1863421 0.0680259 -0.0280855 -0.0000014 0.00112 0.1024562 -0.0000018 -0.0000047 -0.0000028 0.1863419 0.0871461 -0.017251 -0.0000004 0.0084724 0.1005926 0.000001 -0.0000031 0.0000023 0.1732743 0.0871459 0.0172519 -0.0000004 -0.0084664 0.1005902 -0.0000016 -0.0000035 -0.000003 0.1732732 unknown
polarizability: 184.4654273|-0.0006217|72.5868053|0.0020548|0.0001933|30.3885814 unknown
InChI: InChI=1S/C6H4ClN2/c7-5-1-3-6(9-8)4-2-5/h1-4H
charge 1 multiplicity 1
13 atoms
Cl -3.554923 -0.000025 0.000012
N  2.372266 0.000049 0.000001
N  3.531856 -0.000061 0.000132
C  0.99618 0.000031 -0.000016
C  0.310355 -1.257244 -0.000026
C  0.310324 1.257289 -0.000013
C  -1.088137 -1.243454 -0.000024
C  -1.088168 1.243464 -0.000014
C  -1.778202 -0.000004 -0.000023
H  0.862834 -2.201359 -0.000021
H  0.862779 2.201418 0.000004
H  -1.645954 -2.183763 -0.000013
H  -1.646009 2.183759 0.000002
