program: Gaussian 09
title: 000087064
version: EM64L-G09RevD.01
frameworkgroup: C1[X(C12H21NO)]
method: RPBEPBE
basis: SDD
operation: Freq
keyword: #p
keyword: freq=noraman
keyword: PBEPBE/SDD
title: #p freq=noraman PBEPBE/SDD
converged: YES YES NO NO
title: Mulliken charges:
elementType: O N C C C C C C C C C C C C H H H H H H H H H H H H H H H H H H H H H
charge: -0.244939 -0.176781 0.463904 -0.571677 -0.391084 -0.368506 -0.388215 -0.405535 -0.378795 -0.366476 -0.467049 -0.365015 -0.329780 -0.316405 0.212994 0.214822 0.205382 0.199993 0.192647 0.188820 0.194635 0.209216 0.200478 0.196121 0.227201 0.206382 0.208361 0.222561 0.196361 0.192005 0.226656 0.217135 0.190829 0.189593 0.214161
chargesum: 0.00000
title: Mulliken charges with hydrogens summed into heavy atoms:
elementType: O N C C C C C C C C C C C C
charge: -0.244939 -0.176781 0.463904 -0.143861 0.014291 0.012961 0.015636 -0.008937 0.054789 0.064446 -0.078683 -0.138360 0.078184 0.087350
polarizability: 1.65521211e+02 8.58511445e+00 1.39288503e+02 1.31246253e-01 -1.13455351e+00 1.06939191e+02
1716.lowfreq: -12.2133 -2.2729 -0.0008 -0.0006 -0.0006 18.8756 55.1662 68.2585 108.1189
frequency: 55.0609 68.0347 108.1067 133.4217 187.2173 217.1028 224.9385 248.8461 256.3750 279.5870 329.8984 357.7404 380.3401 387.6678 421.5569 444.7371 467.4674 492.3653 532.1372 595.2343 621.9430 699.6912 730.2329 767.8498 799.2465 810.3136 819.0650 842.6260 856.0670 872.6638 888.4395 915.3277 956.4572 989.9390 1010.5432 1016.4125 1022.5505 1037.8443 1054.3164 1084.5740 1090.3492 1094.7960 1108.6193 1130.9163 1144.9865 1172.0835 1178.7895 1180.7024 1196.1908 1230.8748 1241.6007 1254.1023 1257.9152 1274.4189 1281.9741 1301.4736 1315.7226 1329.6655 1330.7486 1338.1481 1339.1945 1346.1979 1347.4682 1357.1986 1365.5068 1372.2007 1375.8746 1444.7924 1449.9292 1452.7868 1456.4102 1459.6792 1460.8534 1463.7157 1468.1976 1472.0781 1494.4628 1645.7522 2894.2535 2900.8674 2949.0856 2952.7444 2955.2923 2956.9425 2964.5531 2972.3912 2980.3523 2982.8617 3006.8522 3013.2509 3021.2005 3028.6197 3034.6059 3036.8459 3037.8744 3066.2722 3078.6255 3082.1068 3121.5696
redmass: 3.7648 3.1012 3.5283 2.9421 2.2694 2.4914 2.7344 2.5097 2.2820 2.4697 3.5266 2.6044 2.0475 2.0850 2.3930 1.8395 2.7094 2.9922 2.2898 2.3521 2.3143 2.3664 2.1195 1.5412 2.3619 2.6111 2.1030 1.7136 2.3282 1.8959 2.0524 2.4094 1.8144 2.2723 2.1880 1.9669 2.1834 2.1952 1.9293 4.1857 2.3189 1.7315 2.1298 2.2616 1.5765 1.5120 1.9363 1.4100 1.1109 1.3215 1.2911 1.3142 1.2008 1.1575 1.2185 1.3120 1.2750 1.4150 1.5865 1.3058 1.3473 1.3202 1.3808 1.4122 1.4702 1.5035 1.5334 1.0817 1.0841 1.0946 1.0859 1.0798 1.0883 1.0972 1.0900 1.0950 1.0886 6.7325 1.0700 1.0704 1.0669 1.0668 1.0597 1.0596 1.0624 1.0610 1.0639 1.0636 1.1000 1.0969 1.0998 1.1005 1.1000 1.0977 1.0932 1.0891 1.0957 1.0972 1.0889
irintensity: 0.1182 0.2207 0.4370 0.7479 1.5554 1.0622 3.7769 2.6058 10.8115 9.9407 0.0662 0.2492 0.9192 0.9888 0.7289 3.0669 0.3938 2.7900 4.2784 10.4962 6.5940 6.5112 7.6887 17.2419 9.3825 22.0764 8.3798 1.5299 7.9906 7.2170 6.1447 9.4791 23.0601 3.1504 6.5737 2.0994 5.4955 14.8282 15.5267 47.5965 8.9000 12.8849 0.3149 1.8531 10.8673 6.4198 32.8561 27.4710 1.4911 30.6989 31.9055 28.9302 6.8169 0.4816 5.0865 2.4901 1.8076 3.6416 11.7035 0.4649 2.9374 6.1229 1.6467 3.6584 3.6157 7.1862 28.7354 2.6285 7.4590 14.2366 2.1511 5.8747 11.2387 15.0670 8.1551 3.2548 33.6697 92.4947 43.6578 73.7877 26.4294 118.8938 45.2136 12.7111 39.4497 62.9417 45.3868 24.5796 26.7565 56.7807 59.5744 61.4812 14.2415 87.1787 67.2462 25.7084 41.5596 34.3291 32.3581
temp: 298.150 k
press: 1.00000 atm
elementType: 8 7 6 6 6 6 6 6 6 6 6 6 6 6 1 1 1 1 1 1 1 1 1 1 1 1 1 1 1 1 1 1 1 1 1
symmnumber: 1
zpe: 820922.2 jmol-1
zpe.correction: 0.312673 hartree
zpe.thermalcorrener: 0.326050 hartree
zpe.thermalcorrenthalpy: 0.326994 hartree
zpe.thermalcorrgfe: 0.273412 hartree
zpe.sumelectzpe: -598.677698 hartree
zpe.sumelectthermal: -598.664320 hartree
zpe.sumelectthermalent: -598.663376 hartree
zpe.sumelectthermalfe: -598.716959 hartree
dipole: -1.1054 0.5668 -0.5187
dipole: 1.3462
quadrupole: -94.8456 -80.7434 -89.1717
quadrupole: -1.3331 -3.4172 -1.0759
quadrupole: -6.5921 7.5102 -0.9181 -1.3331 -3.4172 -1.0759
hfenergy: -598.9903707 hartree
pointgroup: C01 [X(C12H21N1O1)]
dipole: -0.4300281 -0.2226831 0.2145126 debye
polarizability: 165.7121837|-8.2993143|139.0129373|-0.5327607|-1.8743442|107.0237832 unknown
InChI: InChI=1S/C12H21NO/c1-2-4-6-12(7-5-3-1)13-8-10-14-11-9-13/h6H,1-5,7-11H2
charge 0 multiplicity 1
35 atoms
O  3.934935 -0.074043 -0.685502
N  1.214442 0.122651 0.328754
C  -0.193092 0.237191 0.566405
C  -0.838453 -0.973063 1.244321
C  -1.669268 -1.927223 0.334488
C  -3.060275 -1.413577 -0.130147
C  -3.044697 -0.244292 -1.158423
C  -3.307415 1.165185 -0.570478
C  1.934955 1.319995 -0.152577
C  1.7160 -1.120201 -0.314527
C  -2.370834 1.564927 0.61115
C  -0.900197 1.384357 0.299923
C  3.453891 1.134187 0.003547
C  3.236674 -1.246756 -0.134655
H  -0.047273 -1.556386 1.752903
H  -1.50254 -0.611344 2.052757
H  -1.076769 -2.197766 -0.562998
H  -1.827608 -2.869142 0.900189
H  -3.588539 -2.277559 -0.581235
H  -3.659912 -1.125415 0.75826
H  -3.811903 -0.430174 -1.936543
H  -2.068568 -0.240496 -1.681202
H  -4.358606 1.229009 -0.219625
H  -3.200705 1.910013 -1.385522
H  1.621651 2.190442 0.452723
H  1.692331 1.54133 -1.219522
H  1.480056 -1.119599 -1.405263
H  1.225116 -2.000046 0.133925
H  -2.655161 0.971943 1.502263
H  -2.574771 2.623299 0.869613
H  -0.414744 2.216075 -0.22521
H  3.999071 1.974819 -0.456922
H  3.71053 1.07145 1.083649
H  3.480065 -1.352667 0.945307
H  3.629012 -2.114024 -0.691127
