program: Gaussian 09
title: 000087058
version: EM64L-G09RevD.01
frameworkgroup: C1[X(C6H4ClN2)]
method: RPBEPBE
basis: SDD
operation: Freq
keyword: #p
keyword: freq=noraman
keyword: PBEPBE/SDD
title: #p freq=noraman PBEPBE/SDD
converged: NO YES NO YES
title: Mulliken charges:
elementType: Cl N N C C C C C C H H H H
charge: 0.134284 0.018171 0.184410 0.543055 -0.319080 -0.292203 -0.137344 -0.163562 -0.165950 0.300655 0.308621 0.296477 0.292467
chargesum: 1.00000
title: Mulliken charges with hydrogens summed into heavy atoms:
elementType: Cl N N C C C C C C
charge: 0.134284 0.018171 0.184410 0.543055 -0.319080 0.008452 0.171276 0.132915 0.126517
polarizability: 1.28510338e+02 -1.12727820e+01 1.00754332e+02 -4.46593079e-03 7.92513493e-03 3.04238507e+01
1716.lowfreq: -4.5808 0.0024 0.0032 0.0033 2.7740 8.4106 113.8499 139.2522 194.6614
frequency: 113.8468 139.2519 194.6603 270.4279 369.3623 382.1875 455.5500 493.9376 553.6004 569.1377 654.5594 691.9897 770.4196 772.5724 877.6408 973.9644 1012.0387 1020.9429 1034.6128 1140.7819 1177.3174 1194.7041 1266.5027 1387.9033 1415.3380 1440.6757 1541.0008 1570.4865 2108.2631 3169.3090 3175.0237 3184.4469 3195.5867
redmass: 5.4215 14.9527 6.0883 7.8071 14.2535 3.9221 3.6318 8.7856 5.9556 8.3965 6.7162 3.6164 6.5865 1.2866 1.3453 1.3568 1.3999 2.8004 4.8772 1.7335 2.4206 1.2128 1.4767 7.6845 1.9996 2.4705 5.4063 5.9089 13.9257 1.0894 1.0921 1.0967 1.1016
irintensity: 0.3017 0.4785 0.7563 0.9102 5.3442 0.4081 12.0914 4.0113 2.5309 4.0477 8.4901 3.6298 3.6082 94.9946 0.1992 1.1797 0.2451 7.3379 27.3176 11.5418 69.6530 6.2022 14.9975 14.5918 6.2636 108.9811 12.7934 156.9515 202.8278 3.1567 0.3036 8.7973 2.1646
temp: 298.150 k
press: 1.00000 atm
elementType: 17 7 7 6 6 6 6 6 6 1 1 1 1
symmnumber: 1
zpe: 229192.8 jmol-1
zpe.correction: 0.087295 hartree
zpe.thermalcorrener: 0.094768 hartree
zpe.thermalcorrenthalpy: 0.095712 hartree
zpe.thermalcorrgfe: 0.054644 hartree
zpe.sumelectzpe: -799.657673 hartree
zpe.sumelectthermal: -799.650200 hartree
zpe.sumelectthermalent: -799.649256 hartree
zpe.sumelectthermalfe: -799.690324 hartree
dipole: 2.7958 2.3877 0.0003
dipole: 3.6767
quadrupole: -35.2230 -38.5827 -57.4688
quadrupole: -2.7055 0.0014 -0.0004
quadrupole: 8.5352 5.1755 -13.7106 -2.7055 0.0014 -0.0004
hfenergy: -799.7449678 hartree
pointgroup: C01 [X(C6H4Cl1N2)]
dipole: -0.6025734 1.3150308 -0.0001098 debye
dipolederiv: -0.1574762 0.3629282 -0.0000518 0.1529475 -0.3645901 0.0000482 -0.0000185 0.0000325 0.0837178 1.6259358 0.5332045 0.0004249 0.2307237 0.1352976 0.0000648 -0.0007454 -0.0004091 0.2141467 -0.5858137 -0.2840727 -0.0005923 -0.1102147 0.0589347 -0.0000815 0.0007516 0.000369 0.1116141 -1.0061397 -0.2478656 0.0001509 -0.0591038 -0.0125447 0.0000381 0.0002008 0.0000933 0.1120577 0.800433 -0.7128544 0.0001067 0.0973009 0.7688684 -0.0001177 -0.0001088 -0.0000884 -0.0363004 0.4311664 0.2932134 -0.0000285 -0.3126942 -0.05275 0.0000341 -0.0000973 -0.0000401 -0.0448769 -0.5868986 0.5223965 -0.0000568 0.3234602 -0.1468821 0.0000445 -0.0000338 0.0001141 -0.0319631 -0.2589898 -0.4692071 0.0000419 -0.3090954 -0.1877675 -0.0000052 -0.0000015 -0.0000946 -0.0940131 0.3906712 0.003127 0.0000295 -0.023632 0.443438 -0.000036 0.0000138 -0.0000007 -0.0150084 0.0745053 -0.0260835 -0.000008 -0.0121124 0.1013741 0.0000027 -0.0000056 0.0000145 0.1868631 0.1210665 0.0119768 -0.0000034 0.0098487 0.0787778 -0.0000028 0.0000506 -0.0000266 0.1750612 0.091229 0.0226606 -0.0000032 0.0153005 0.0685666 0.0000111 0.0000415 0.0000435 0.1780696 0.0603108 -0.0094237 -0.0000099 -0.002729 0.1092772 -0.0000003 -0.0000475 -0.0000074 0.1606317 unknown
polarizability: 132.2020006|-3.3138265|97.0626696|-0.007386|-0.0053102|30.4238507 unknown
InChI: InChI=1S/C6H4ClN2/c7-5-3-1-2-4-6(5)9-8/h1-4H
charge 1 multiplicity 1
13 atoms
Cl 1.011934 -2.375044 0.000307
N  1.793499 0.547253 0.000399
N  2.939731 0.709012 -0.000829
C  0.429034 0.364512 0.000241
C  -0.093637 -0.974065 0.00017
C  -0.419812 1.518699 0.000102
C  -1.48643 -1.143927 -0.000001
C  -1.804553 1.312981 -0.000038
C  -2.332903 -0.008125 -0.000102
H  0.013672 2.523153 0.000138
H  -1.906234 -2.153742 -0.000052
H  -2.477686 2.174248 -0.000111
H  -3.417115 -0.157054 -0.000224
