program: Gaussian 09
title: 000087017
version: EM64L-G09RevD.01
frameworkgroup: C1[X(C4H3ClS)]
method: RPBEPBE
basis: SDD
operation: Freq
keyword: #p
keyword: freq=noraman
keyword: PBEPBE/SDD
title: #p freq=noraman PBEPBE/SDD
converged: NO YES NO NO
title: Mulliken charges:
elementType: Cl S C C C C H H H
charge: -0.046627 0.289918 0.063949 -0.080146 -0.542006 -0.512490 0.267728 0.288699 0.270975
chargesum: 0.00000
title: Mulliken charges with hydrogens summed into heavy atoms:
elementType: Cl S C C C C
charge: -0.046627 0.289918 0.063949 0.187583 -0.253307 -0.241516
polarizability: 9.06587068e+01 -7.18990117e-01 6.48647734e+01 2.18703609e-03 1.34807883e-03 2.44010101e+01
1716.lowfreq: -5.5402 -0.0033 -0.0005 0.0020 7.0680 17.2530 198.9580 260.7944 393.9566
frequency: 198.9553 260.7944 393.9566 430.0865 588.9749 608.1193 660.4195 732.5271 755.3432 797.3085 869.3736 872.4202 1079.3178 1091.3708 1189.1812 1341.6053 1452.5368 1519.0955 3195.6260 3243.1744 3252.0329
redmass: 8.7034 7.0184 18.7854 4.3725 3.3818 8.8930 1.2214 7.0086 1.2805 5.1657 5.2660 1.3132 1.4859 1.1903 1.3409 2.4849 8.5736 6.3325 1.0928 1.0998 1.0982
irintensity: 0.6844 0.3072 4.0484 0.0009 22.7020 5.4833 2.9772 2.6920 134.5175 17.0658 46.2191 1.5541 3.8466 13.7212 6.3977 28.7302 3.4970 28.3086 0.5935 0.2063 3.6927
temp: 298.150 k
press: 1.00000 atm
elementType: 17 16 6 6 6 6 1 1 1
symmnumber: 1
zpe: 146735.3 jmol-1
zpe.correction: 0.055889 hartree
zpe.thermalcorrener: 0.061285 hartree
zpe.thermalcorrenthalpy: 0.062229 hartree
zpe.thermalcorrgfe: 0.026055 hartree
zpe.sumelectzpe: -1011.884995 hartree
zpe.sumelectthermal: -1011.879599 hartree
zpe.sumelectthermalent: -1011.878654 hartree
zpe.sumelectthermalfe: -1011.914829 hartree
dipole: 1.3270 0.5891 0.0001
dipole: 1.4519
quadrupole: -49.8678 -42.4338 -52.3293
quadrupole: 1.6567 0.0003 0.0004
quadrupole: -1.6575 5.7765 -4.1190 1.6567 0.0003 0.0004
hfenergy: -1011.9408839 hartree
pointgroup: C01[X(C4H3Cl1S1)]
dipole: -0.5390643 -0.1889277 0.0000447 debye
dipolederiv: -0.7205355 0.0423787 0.0000188 0.0084097 -0.1073264 0.0000008 0.0000318 -0.0000025 -0.0358723 -0.2672295 0.1291372 0.0000101 0.1260438 -0.1006426 0.0000016 0.0000215 0.0000026 0.1597731 1.0088777 -0.0101527 -0.0000288 0.1201471 0.085055 -0.0000101 -0.0000504 0.0000006 -0.0565861 -0.3674587 0.1027703 0.0000147 0.0657321 -0.0404104 -0.0000087 0.0000149 -0.0000147 -0.1035006 0.1361205 -0.0660718 -0.0000139 -0.0265244 -0.1873526 0.0000033 -0.000025 0.0000152 -0.30102 0.0114033 -0.2084877 -0.0000175 -0.2653176 0.2413128 -0.0000044 -0.000014 -0.0000167 -0.331495 0.0884986 0.0819193 -0.0000011 0.033511 0.0153712 0.0000055 -0.0000006 0.000009 0.2062634 0.0668958 -0.0425481 0.0000052 -0.0159164 0.0629033 0.0000036 0.0000082 -0.000004 0.2353114 0.0434278 -0.0289451 0.0000126 -0.0460852 0.0310896 0.0000083 0.0000136 0.0000106 0.227126 unknown
polarizability: 90.3753694|-2.7829933|65.1481108|-0.0022886|-0.0011673|24.4010101 unknown
InChI: InChI=1S/C4H3ClS/c5-4-1-2-6-3-4/h1-3H
charge 0 multiplicity 1
9 atoms
Cl 2.52575 0.044655 -0.000095
S  -1.783105 0.826207 0.000017
C  0.716796 0.047262 -0.000037
C  -0.050284 -1.174513 -0.000011
C  -0.030013 1.209294 -0.000075
C  -1.41282 -0.93376 0.000054
H  0.397946 -2.169623 0.000011
H  0.308431 2.242388 -0.000098
H  -2.2309 -1.651011 0.000134
