program: Gaussian 09
title: 000087032
version: EM64L-G09RevD.01
frameworkgroup: C1[X(C11H16N2O)]
method: RPBEPBE
basis: SDD
operation: Freq
keyword: #p
keyword: freq=noraman
keyword: PBEPBE/SDD
title: #p freq=noraman PBEPBE/SDD
converged: YES YES NO NO
title: Mulliken charges:
elementType: O N N C C C C C C C C C C C H H H H H H H H H H H H H H H H
charge: -0.310165 -0.361246 -0.650549 0.215130 -0.548287 0.328416 0.316803 -0.433740 -0.437812 -0.427314 -0.843582 -0.854206 -0.237235 0.275035 0.205934 0.254619 0.229846 0.264184 0.226428 0.228936 0.220112 0.231290 0.232342 0.228315 0.280507 0.221470 0.221860 0.282458 0.300149 0.340300
chargesum: 0.00000
title: Mulliken charges with hydrogens summed into heavy atoms:
elementType: O N N C C C C C C C C C C C
charge: -0.310165 -0.078788 -0.010100 0.215130 -0.087733 0.328416 0.316803 0.060289 -0.211384 -0.198378 -0.159837 -0.123914 -0.015375 0.275035
polarizability: 1.76393934e+02 -1.26920653e+00 1.48581186e+02 -1.46632316e+01 1.53901192e+00 7.81785145e+01
1716.lowfreq: -18.9061 -9.6209 -4.7040 -0.0007 -0.0005 0.0003 37.7408 51.5218 59.8606
frequency: 37.6292 51.5202 59.8556 89.6072 97.3230 140.5761 156.1882 170.2988 224.9080 232.2121 274.3295 289.5616 329.7155 341.4797 351.7955 455.2902 455.9821 467.5125 503.8707 512.9021 521.6438 532.4724 550.7801 624.8304 682.8538 717.5059 749.6712 766.7302 778.5027 827.1514 872.6854 898.6882 908.8832 972.9656 990.0690 1001.9409 1008.5766 1032.3445 1042.3289 1044.1475 1087.9670 1095.5840 1129.3829 1175.5722 1192.6248 1194.7173 1263.0116 1263.4509 1283.4765 1298.1773 1317.6397 1361.5561 1370.4607 1396.5131 1409.3627 1436.0218 1447.0730 1452.5793 1473.9024 1477.0784 1479.0042 1484.2731 1498.8766 1502.7701 1595.3280 1598.1451 1605.1022 1644.2541 2968.4858 2969.1147 3004.4459 3013.2063 3042.0099 3047.4223 3062.2000 3079.5906 3082.6403 3087.9750 3114.0056 3123.8925 3150.8856 3542.7221 3560.1747 3701.0767
redmass: 4.7616 4.8299 4.1257 3.8074 3.9613 1.0595 1.3135 1.9567 2.7760 1.1342 2.9299 2.5174 3.2032 3.1205 2.8295 1.4200 1.9704 3.2938 1.2815 2.8782 3.2962 4.4308 3.7689 3.7029 4.0530 8.8959 2.8772 1.4489 1.2691 4.1666 2.8195 1.3171 2.4241 1.3635 1.6025 3.8350 1.4597 1.8049 1.5609 1.6674 2.1291 1.7708 2.8440 1.1650 3.2077 1.4693 2.9058 1.5829 1.3607 1.2209 1.7694 1.2681 5.2245 1.2547 1.2240 1.9906 1.1677 1.9211 1.0728 1.2665 1.1671 1.1511 2.1873 1.0910 5.5360 1.5104 5.6323 3.0402 1.0389 1.0391 1.0602 1.0637 1.0969 1.0938 1.0975 1.0979 1.0998 1.1035 1.0852 1.0915 1.0994 1.0474 1.0757 1.1039
irintensity: 5.3119 7.3342 8.9669 2.8545 4.1805 0.5162 0.1977 1.3617 0.1005 8.8260 5.1387 9.9047 9.9660 2.2487 1.4086 316.3590 114.7480 26.5020 2.6472 4.6753 0.6562 1.3219 3.9475 3.7611 3.2005 18.5235 4.6448 4.8929 50.8163 0.3784 1.9768 0.0551 0.9672 0.4414 4.1144 17.5154 4.9114 7.8865 1.8699 7.8273 0.5178 18.3214 31.9328 2.9554 0.1108 6.4226 2.1887 0.3688 1.9326 1.2811 212.8373 3.6712 1.7512 12.8467 11.8972 0.1665 27.0839 5.1224 5.9873 36.6651 32.4691 38.2711 350.4267 14.2467 0.4617 95.1524 2.9745 285.8169 50.2960 9.0982 20.4894 44.1905 25.4811 17.0112 9.5499 29.3431 20.1577 7.5782 0.3089 32.7825 39.7841 40.8437 7.6039 36.0758
temp: 298.150 k
press: 1.00000 atm
elementType: 8 7 7 6 6 6 6 6 6 6 6 6 6 6 1 1 1 1 1 1 1 1 1 1 1 1 1 1 1 1
symmnumber: 1
zpe: 663036.7 jmol-1
zpe.correction: 0.252537 hartree
zpe.thermalcorrener: 0.267514 hartree
zpe.thermalcorrenthalpy: 0.268459 hartree
zpe.thermalcorrgfe: 0.210111 hartree
zpe.sumelectzpe: -612.472324 hartree
zpe.sumelectthermal: -612.457346 hartree
zpe.sumelectthermalent: -612.456402 hartree
zpe.sumelectthermalfe: -612.514750 hartree
dipole: -2.3718 4.2239 0.4071
dipole: 4.8614
quadrupole: -66.1324 -78.2550 -88.5349
quadrupole: -12.1579 -3.6663 -0.6312
quadrupole: 11.5084 -0.6142 -10.8941 -12.1579 -3.6663 -0.6312
hfenergy: -612.7248609 hartree
pointgroup: C01 [X(C11H16N2O1)]
dipole: 0.9824318 1.6319256 -0.1723436 debye
polarizability: 176.2793482|0.351312|148.519509|-15.2488044|-1.3830027|78.3547776 unknown
InChI: InChI=1S/C11H16N2O/c1-8-4-3-5-9(2)10(8)6-7-13-11(12)14/h3-5,13H,6-7,12H2,1-2H3
charge 0 multiplicity 1
30 atoms
O  3.107355 -1.380019 0.190753
N  2.703158 0.919174 0.339325
N  4.867631 0.114062 -0.147932
C  -1.026657 0.178844 -0.321211
C  0.405581 0.561811 -0.670365
C  -2.014078 1.188913 -0.105254
C  -1.367825 -1.20003 -0.153779
C  1.272819 0.724316 0.616281
C  -3.325261 0.811092 0.276916
C  -2.688145 -1.542448 0.232763
C  -1.694922 2.665983 -0.293498
C  -0.357288 -2.30863 -0.413626
C  -3.664642 -0.547585 0.449346
C  3.531164 -0.18252 0.1301
H  0.438294 1.503555 -1.248929
H  0.880736 -0.219632 -1.288104
H  0.90911 1.575529 1.220803
H  1.174802 -0.187147 1.229555
H  -4.081604 1.588497 0.440117
H  -2.948218 -2.60012 0.361358
H  -0.851047 2.997338 0.341097
H  -1.420306 2.894643 -1.3416
H  -2.568232 3.289284 -0.035692
H  -0.151408 -2.411392 -1.497835
H  0.620141 -2.134398 0.071242
H  -0.747645 -3.278779 -0.060828
H  -4.681036 -0.828021 0.748619
H  3.048776 1.864132 0.172484
H  5.260753 1.051655 -0.10796
H  5.486996 -0.676906 -0.302747
