program: Gaussian 09
title: 000087057
version: EM64L-G09RevD.01
frameworkgroup: C1[X(C9H19N3O2Si2)]
method: RPBEPBE
basis: SDD
operation: Freq
keyword: #p
keyword: freq=noraman
keyword: PBEPBE/SDD
title: #p freq=noraman PBEPBE/SDD
converged: NO YES NO NO
title: Mulliken charges:
elementType: Si Si O O N N N C C C C C C C C C H H H H H H H H H H H H H H H H H H H
charge: 1.384451 1.404792 -0.534409 -0.511530 -0.073801 -0.174416 -0.023928 -1.027239 -1.039591 -1.039593 -1.030370 -1.042967 -1.042967 0.243589 0.093796 -0.377138 0.252592 0.232617 0.252593 0.243711 0.284711 0.235359 0.235360 0.284712 0.243710 0.251655 0.230206 0.251656 0.241699 0.287384 0.233686 0.287390 0.241698 0.233685 0.266895
chargesum: 0.00000
title: Mulliken charges with hydrogens summed into heavy atoms:
elementType: Si Si O O N N N C C C C C C C C C
charge: 1.384451 1.404792 -0.534409 -0.511530 -0.073801 -0.174416 -0.023928 -0.289437 -0.275810 -0.275811 -0.296854 -0.280197 -0.280194 0.243589 0.093796 -0.110243
polarizability: 2.29909541e+02 6.42250851e+00 1.68633234e+02 -1.30716197e-03 -3.12327496e-03 1.33949626e+02
1716.lowfreq: -0.0017 -0.0015 -0.0012 1.9930 8.6362 12.3287 30.7273 32.4157 54.1943
frequency: 30.6913 32.3712 54.1878 62.8435 72.5993 97.2736 98.3179 110.6146 134.6638 135.7425 136.7859 142.7122 148.1130 161.1791 168.1488 173.6070 194.8267 197.5532 199.0060 211.9569 222.0621 228.4113 264.0644 281.7654 330.3991 373.6228 461.3608 530.8334 587.8049 593.0976 600.6200 639.3422 685.5597 689.7546 711.5969 711.6859 713.4150 715.4529 757.8624 758.7921 768.3803 798.4493 819.9685 821.2780 822.3301 827.9353 862.0723 915.5656 919.9736 922.2635 923.6475 925.8018 936.1788 942.4920 1023.9728 1042.2326 1158.8921 1291.4117 1299.1711 1301.8601 1302.8034 1305.2152 1312.7861 1315.6328 1317.0479 1404.7075 1432.0646 1432.7066 1442.7524 1444.7262 1444.7933 1445.6067 1446.7883 1447.2837 1448.0928 1453.2296 1453.8474 1465.8801 1467.8614 1485.2300 2987.6767 2987.9813 2988.4874 2988.6009 2990.1596 2990.7591 3086.2388 3086.5086 3086.7235 3087.1736 3091.0895 3091.7932 3100.6925 3102.3283 3111.1257 3111.9431 3113.4307 3113.9719 3191.6622
redmass: 3.3243 2.9539 4.4269 3.9176 4.6003 4.3178 1.0282 1.0252 1.0443 1.0216 1.0513 1.0572 2.5727 4.3255 3.1005 3.5054 2.7755 2.8275 2.7328 3.2903 2.8298 2.9128 4.2647 6.2056 6.1580 6.0265 12.7159 9.9514 5.3056 6.1813 5.4420 7.2641 8.7496 5.6588 2.7318 2.7207 2.8715 2.8400 1.1800 1.1771 5.7417 4.3001 1.3827 1.4221 1.4303 1.7071 1.4568 1.5320 1.6447 1.5459 1.5521 1.6002 1.6952 4.7560 5.6694 7.6614 4.4841 1.8096 1.2046 1.2043 1.3969 1.2247 3.7363 1.2578 1.2277 8.6112 1.0517 1.0518 1.8699 1.0636 1.0480 1.0488 1.1870 1.1160 1.5213 1.0511 1.0523 1.0796 1.0677 4.6751 1.0352 1.0351 1.0351 1.0351 1.0349 1.0349 1.0971 1.0970 1.0972 1.0971 1.0974 1.0973 1.0985 1.0986 1.0993 1.0989 1.0989 1.0985 1.0934
irintensity: 1.0759 0.0792 2.5315 0.7304 0.1655 2.1917 0.0013 0.0042 0.0085 0.0136 0.0721 0.0589 0.7854 1.8523 3.3486 1.9382 0.5725 0.7790 1.4750 1.7867 3.7793 6.1133 2.0918 19.7632 60.8509 13.0161 17.3549 17.0970 2.7680 3.7176 5.2112 25.3935 114.9228 2.4685 0.0135 16.3037 11.3288 7.6215 0.2921 0.0905 1.6674 16.0757 46.3269 3.3243 34.6283 14.7438 26.9053 536.1022 126.7627 0.0082 221.1779 122.6669 125.7905 87.6939 110.9676 12.7393 205.6718 88.3395 62.5311 57.6823 126.9510 59.8012 316.7406 133.9361 7.2988 93.4969 0.0315 0.1549 156.3771 16.4898 3.4735 6.5624 94.9507 29.7620 211.3211 1.2756 3.1461 9.4283 90.2922 420.1384 10.0836 11.5390 8.5368 4.8578 17.5338 12.1607 3.9191 5.4176 13.8327 10.7470 28.8141 23.2431 12.6674 12.0551 2.5107 8.9051 2.0095 7.7170 1.7834
temp: 298.150 k
press: 1.00000 atm
elementType: 14 14 8 8 7 7 7 6 6 6 6 6 6 6 6 6 1 1 1 1 1 1 1 1 1 1 1 1 1 1 1 1 1 1 1
symmnumber: 1
zpe: 713703.9 jmol-1
zpe.correction: 0.271835 hartree
zpe.thermalcorrener: 0.294150 hartree
zpe.thermalcorrenthalpy: 0.295094 hartree
zpe.thermalcorrgfe: 0.219726 hartree
zpe.sumelectzpe: -1246.664824 hartree
zpe.sumelectthermal: -1246.642510 hartree
zpe.sumelectthermalent: -1246.641566 hartree
zpe.sumelectthermalfe: -1246.716934 hartree
dipole: 1.2478 -2.9109 0.0002
dipole: 3.1671
quadrupole: -90.9947 -119.1417 -109.6558
quadrupole: 2.1697 -0.0004 0.0008
quadrupole: 15.6027 -12.5443 -3.0584 2.1697 -0.0004 0.0008
hfenergy: -1246.9366596 hartree
pointgroup: C01 [X(C9H19N3O2Si2)]
dipole: -0.4905282 -1.1454183 -0.0000921 debye
polarizability: 229.9141046|-6.4006978|168.6286702|-0.0013083|0.0031228|133.9496263 unknown
InChI: InChI=1S/C9H19N3O2Si2/c1-15(2,3)13-8-7-10-12-9(11-8)14-16(4,5)6/h7H,1-6H3
charge 0 multiplicity 1
35 atoms
Si -3.500817 -0.831338 -0.000081
Si 3.514922 -0.768481 -0.000091
O  -2.654639 0.77712 0.000045
O  1.705603 -0.874828 -0.0001
N  -0.484207 -0.111843 -0.000039
N  1.414598 1.441851 0.000072
N  0.555789 2.519804 0.00019
C  -5.304293 -0.247715 -0.000021
C  -3.01965 -1.754606 -1.586968
C  -3.019639 -1.754887 1.586638
C  3.943882 -2.615868 -0.000166
C  4.062656 0.11413 -1.588173
C  4.062634 0.114006 1.588069
C  -1.314703 0.964734 0.000092
C  0.853711 0.172588 -0.000063
C  -0.784185 2.29553 0.000182
H  -5.518472 0.364968 -0.893302
H  -5.998735 -1.108295 -0.000049
H  -5.518434 0.364874 0.893333
H  -3.244933 -1.149239 -2.483017
H  -1.940936 -1.983701 -1.577263
H  -3.580854 -2.704463 -1.669437
H  -3.580786 -2.704796 1.668902
H  -1.94091 -1.983915 1.576911
H  -3.244979 -1.149714 2.482804
H  3.528184 -3.114673 -0.893294
H  5.03925 -2.768047 -0.00015
H  3.528148 -3.114753 0.8929
H  3.667751 -0.397762 -2.48385
H  3.693358 1.153117 -1.581767
H  5.166127 0.130205 -1.665276
H  3.693304 1.152983 1.581745
H  3.667736 -0.397972 2.4837
H  5.166103 0.130107 1.665175
H  -1.434485 3.171879 0.000248
