program: Gaussian 09
title: 000087013
version: EM64L-G09RevD.01
frameworkgroup: C1[X(C15H16O2)]
method: RPBEPBE
basis: SDD
operation: Freq
keyword: #pfreq=noraman
keyword: PBEPBE/SDD
title: #p freq=noraman PBEPBE/SDD
converged: YES YES NO NO
title: Mulliken charges:
elementType: O O C C C C C C C C C C C C C C C H H H H H H H H H H H H H H H H
charge: -0.247950 -0.247954 0.440004 0.440002 0.344132 0.344130 -0.422358 -0.422350 -0.326906 -0.326911 -0.344402 -0.344402 -0.373619 -0.373619 -0.210953 -0.807942 -0.807941 0.228297 0.228297 0.231938 0.231938 0.235637 0.235636 0.255574 0.255574 0.210561 0.210484 0.230181 0.222893 0.229476 0.222892 0.230193 0.229465
chargesum: 0.00000
title: Mulliken charges with hydrogens summed into heavy atoms:
elementType: O O C C C C C C C C C C C C C C C
charge: -0.247950 -0.247954 0.440004 0.440002 0.344132 0.344130 -0.194061 -0.194053 -0.094968 -0.094973 -0.108764 -0.108765 -0.118045 -0.118045 0.210092 -0.125392 -0.125391
polarizability: 2.74805890e+02 6.03611178e-05 1.63876830e+02 1.18994475e-02 -3.25777062e-01 8.04284526e+01
1716.lowfreq: -6.6251 -0.0010 -0.0007 -0.0006 2.7998 8.1104 21.8967 39.1020 45.1396
frequency: 20.8415 39.0800 45.1383 46.6318 57.4701 60.9259 140.2004 149.7922 159.0239 177.8867 199.6186 299.8862 326.4620 326.9751 334.1618 412.2052 412.9766 418.8528 431.6703 502.2593 506.3652 519.9837 540.9480 634.8060 635.2166 708.0325 708.4705 709.2924 765.8843 799.5257 803.7790 810.4747 829.9744 830.5245 851.4083 925.3517 926.5839 964.6545 964.8107 984.6261 984.7515 1005.7736 1007.0069 1017.1346 1035.6237 1047.0968 1047.1281 1097.4663 1121.2492 1122.6733 1180.9665 1187.4867 1198.5794 1205.4629 1221.3839 1222.9933 1249.0986 1306.6448 1307.8284 1367.9262 1372.5855 1391.7118 1399.0886 1399.3915 1415.0494 1415.6997 1471.1483 1471.1627 1477.6418 1477.6700 1487.1240 1502.3664 1510.3813 1586.1823 1587.6067 1627.6484 1628.9090 2899.1423 2959.0233 2974.4415 2974.5463 3051.5739 3051.5848 3081.8330 3081.8444 3124.5951 3124.6387 3126.6242 3126.8953 3156.4035 3156.6826 3167.7052 3167.7460
redmass: 3.8191 4.2398 4.5573 2.2696 1.0867 1.3517 3.7457 4.2229 4.5845 2.3482 6.0477 3.1692 4.3091 4.2446 2.7998 2.9091 2.9255 3.9162 6.0115 2.4641 2.4912 5.0347 6.0911 6.6903 6.8985 4.6111 3.2290 3.0468 5.0231 1.4180 1.3997 5.8493 1.3485 1.3535 7.2309 1.3259 1.3249 1.3445 1.3447 1.4680 1.4803 2.6468 2.6186 6.3886 6.6354 1.5305 1.5304 1.4528 1.2697 1.2637 1.4723 1.1450 1.0476 1.9822 2.5678 3.6742 5.6172 1.2858 1.2923 3.3046 5.0470 1.3767 1.2478 1.2729 3.4698 3.4598 1.0457 1.0457 1.0987 1.0986 1.2552 2.6340 2.0001 6.4828 6.4065 6.4350 6.4145 1.0490 1.1118 1.0372 1.0372 1.0977 1.0977 1.0985 1.0985 1.0891 1.0892 1.0889 1.0889 1.0947 1.0946 1.0954 1.0954
irintensity: 0.1408 0.0000 0.1735 0.0000 0.8253 0.0012 1.2932 0.0000 0.1551 15.3014 0.8055 0.4997 0.0006 8.3953 1.0427 0.0001 0.0014 0.0274 0.3481 0.0031 41.8094 0.1331 0.1830 0.8795 0.0040 7.6759 1.3329 0.4914 1.8173 0.0103 89.2651 4.7216 0.0044 64.2278 2.0967 0.0015 1.2506 0.0027 1.7155 23.2586 0.8089 49.1516 0.1123 365.2970 13.8770 0.0237 22.7098 4.8991 0.1405 29.1412 364.6054 0.0042 2.3531 459.3120 0.2118 27.4368 3.2211 6.7162 0.1634 0.6797 1.8023 78.1093 1.3140 41.5472 7.9373 0.1919 0.2241 24.9014 5.8146 21.8879 5.2413 288.2008 14.8646 13.7674 12.0009 60.7165 0.0889 26.8539 63.3876 89.9139 5.9080 0.3181 46.2728 3.7599 35.9206 0.0131 28.6968 58.6519 0.8130 24.2043 19.1990 0.2215 6.8187
temp: 298.150 k
press: 1.00000 atm
elementType: 8 8 6 6 6 6 6 6 6 6 6 6 6 6 6 6 6 1 1 1 1 1 1 1 1 1 1 1 1 1 1 1 1
symmnumber: 1
zpe: 701990.8 jmol-1
zpe.correction: 0.267374 hartree
zpe.thermalcorrener: 0.283864 hartree
zpe.thermalcorrenthalpy: 0.284808 hartree
zpe.thermalcorrgfe: 0.220562 hartree
zpe.sumelectzpe: -730.388616 hartree
zpe.sumelectthermal: -730.372126 hartree
zpe.sumelectthermalent: -730.371182 hartree
zpe.sumelectthermalfe: -730.435427 hartree
dipole: 0.0000 2.6238 0.0137
dipole: 2.6239
quadrupole: -78.1792 -94.5302 -106.9192
quadrupole: 0.0001 0.0034 -0.1313
quadrupole: 15.0304 -1.3207 -13.7097 0.0001 0.0034 -0.1313
hfenergy: -730.65599 hartree
pointgroup: C01 [X(C15H16O2)]
dipole: -0.0001668 -1.0297855 -0.0721056 debye
polarizability: 274.8058877|-0.0162239|163.5703343|-0.0080801|5.0585578|80.7349508 unknown
InChI: InChI=1S/C15H16O2/c1-12-3-7-14(8-4-12)16-11-17-15-9-5-13(2)6-10-15/h3-10H,11H2,1-2H3
charge 0 multiplicity 1
33 atoms
O  -1.129565 0.980463 0.099699
O  1.129306 0.980057 0.100601
C  -5.098464 -0.556581 -0.021596
C  5.097747 -0.558117 -0.021536
C  -2.411826 0.396463 0.055625
C  2.411392 0.395696 0.056186
C  -4.004205 -1.45081 -0.065868
C  4.003223 -1.452025 -0.065744
C  -4.81234 0.834692 0.063933
C  4.812036 0.833225 0.064228
C  -2.664457 -0.993436 -0.028371
C  2.663615 -0.994268 -0.027981
C  -3.490605 1.311989 0.102299
C  3.490444 1.310901 0.102831
C  -0.000273 0.08203 0.048069
C  -6.533537 -1.053266 -0.064959
C  6.53267 -1.055205 -0.065252
H  -4.192859 -2.529175 -0.130942
H  4.191557 -2.530439 -0.130949
H  -5.640201 1.553333 0.100869
H  5.640109 1.551622 0.101143
H  -1.850729 -1.724774 -0.064253
H  1.849674 -1.725375 -0.063724
H  -3.268276 2.381284 0.167883
H  3.268437 2.380253 0.168577
H  -0.00076 -0.605726 0.924312
H  0.000007 -0.500111 -0.901673
H  -7.069616 -0.661647 -0.950278
H  -6.579117 -2.155228 -0.107175
H  -7.100893 -0.727955 0.827447
H  6.577939 -2.157203 -0.106892
H  7.068459 -0.664217 -0.951028
H  7.100507 -0.729551 0.826719
