program: Gaussian 09
title: 000087012
version: EM64L-G09RevD.01
frameworkgroup: C1[X(CH2S6)]
method: RPBEPBE
basis: SDD
operation: Freq
keyword: #p
keyword: freq=noraman
keyword: PBEPBE/SDD
title: #p freq=noraman PBEPBE/SDD
converged: NO NO NO NO
title: Mulliken charges:
elementType: S S S S S S C H H
charge: 0.119058 0.119047 -0.024533 -0.024531 -0.007995 -0.007996 -0.817049 0.321999 0.322001
chargesum: 0.00000
title: Mulliken charges with hydrogens summed into heavy atoms:
elementType: S S S S S S C
charge: 0.119058 0.119047 -0.024533 -0.024531 -0.007995 -0.007996 -0.173049
polarizability: 1.56930433e+02 4.32728255e-04 1.32964867e+02 -2.64674300e-04 2.22807761e+00 7.56532200e+01
1716.lowfreq: -14.6538 -0.0021 0.0020 0.0023 11.0028 14.1421 51.7106 98.9290 121.8971
frequency: 51.6576 98.9055 121.8869 137.8980 170.0314 189.2492 216.7351 275.3306 321.3330 336.7865 386.4480 392.6254 406.4380 570.3857 656.3131 794.8395 1126.9661 1199.6674 1379.6268 3023.1597 3114.4435
redmass: 5.3306 27.6254 21.5092 24.7136 4.6790 29.5912 14.1847 31.9335 17.0281 27.5440 31.1663 25.6578 27.1375 7.5496 6.7198 1.5200 1.0236 1.1003 1.0696 1.0528 1.1101
irintensity: 2.2991 0.1192 0.5345 0.0280 5.5609 1.0400 0.2901 1.9341 0.1757 0.7445 5.9038 1.3461 2.4902 0.2376 6.6406 8.6590 0.0347 0.2153 5.4146 0.9173 2.3849
temp: 298.150 k
press: 1.00000 atm
elementType: 16 16 16 16 16 16 6 1 1
symmnumber: 1
zpe: 89544.8 jmol-1
zpe.correction: 0.034106 hartree
zpe.thermalcorrener: 0.044187 hartree
zpe.thermalcorrenthalpy: 0.045131 hartree
zpe.thermalcorrgfe: -0.003256 hartree
zpe.sumelectzpe: -2427.114469 hartree
zpe.sumelectthermal: -2427.104387 hartree
zpe.sumelectthermalent: -2427.103443 hartree
zpe.sumelectthermalfe: -2427.151830 hartree
dipole: 2.2743 -0.0001 0.0000
dipole: 2.2743
quadrupole: -78.6872 -90.3832 -87.0791
quadrupole: -0.0001 -0.0002 1.6476
quadrupole: 6.6960 -5.0001 -1.6959 -0.0001 -0.0002 1.6476
hfenergy: -2427.1485743 hartree
pointgroup: C01 [X(C1H2S6)]
dipole: -0.8947763 0.0002064 -0.0000559 debye
dipolederiv: -0.1485744 0.1049869 -0.0169514 -0.0283097 -0.125228 -0.0015208 0.1711153 -0.0241613 0.0173023 -0.1486098 -0.1049711 0.0169297 0.0283294 -0.1252054 -0.0015202 -0.1711334 -0.024108 0.0172749 0.288286 0.0271314 -0.0984167 -0.0375718 -0.0816747 -0.0666993 -0.1473351 0.0380094 -0.044342 0.2882929 -0.0272629 0.0984138 0.0374433 -0.0816761 -0.06673 0.1473737 0.0379529 -0.0443186 -0.1540688 -0.1655868 0.1142601 -0.1278101 0.0336233 0.011649 0.0036129 -0.0263745 0.0035192 -0.1539639 0.1656463 -0.1142695 0.1278753 0.0334947 0.0116946 -0.0036254 -0.0263618 0.0035116 -0.0313837 0.0000343 0.0000373 0.0000235 0.2624723 0.1540229 0.0000068 0.1157797 -0.0108005 0.0299923 -0.0207456 0.0465463 -0.0189155 0.0421098 -0.0204604 0.0435848 -0.0453786 0.0289365 0.0300294 0.0207674 -0.0465497 0.0189356 0.0420842 -0.0204357 -0.0435997 -0.0453578 0.0289168 unknown
polarizability: 156.9304324|-0.0043299|132.8899234|0.0034738|-3.0420214|75.7281645 unknown
InChI: InChI=1S/CH2S6/c1-2-4-6-7-5-3-1/h1H2
charge 0 multiplicity 1
9 atoms
S  -1.306533 1.475847 0.727615
S  -1.307031 -1.475375 -0.727775
S  0.337652 1.967535 -0.752252
S  0.336863 -1.967629 0.75225
S  2.169394 1.094022 0.308947
S  2.169007 -1.09483 -0.308831
C  -2.225557 0.000452 -0.000176
H  -2.852307 -0.3269 0.846328
H  -2.851988 0.328078 -0.846807
