program: Gaussian 09
title: 000086996
version: EM64L-G09RevD.01
frameworkgroup: C1[X(C8H6BrN)]
method: RPBEPBE
basis: SDD
operation: Freq
keyword: #p
keyword: freq=noraman
keyword: PBEPBE/SDD
title: #p freq=noraman PBEPBE/SDD
converged: NO NO NO NO
title: Mulliken charges:
elementType: Br N C C C C C C C C H H H H H H
charge: -0.017774 -0.013152 0.518411 -0.328302 -0.328280 -0.854224 -0.359950 -0.360016 0.398709 -0.249757 0.245473 0.245481 0.290400 0.290401 0.261281 0.261301
chargesum: 0.00000
title: Mulliken charges with hydrogens summed into heavy atoms:
elementType: Br N C C C C C C C C
charge: -0.017774 -0.013152 0.518411 -0.082829 -0.082799 -0.273424 -0.098669 -0.098716 0.398709 -0.249757
polarizability: 1.81690423e+02 1.09269342e-02 8.53198102e+01 7.01824036e+00 -2.17760778e-03 6.31817853e+01
1716.lowfreq: -6.5296 -4.5015 0.0003 0.0005 0.0005 17.9211 46.9144 54.8895 128.5714
frequency: 46.7024 54.8689 128.5703 150.7132 252.5787 323.5329 399.8203 401.2342 442.3713 541.4455 545.5622 590.9726 641.6338 691.5975 749.3964 819.5352 851.4692 862.0918 878.3781 976.1451 984.6904 1012.3840 1090.0607 1136.8965 1189.1479 1205.8158 1214.8964 1233.1838 1312.4963 1370.7617 1413.8602 1460.9583 1498.5592 1566.6654 1618.0125 2172.9077 3066.7718 3137.1946 3138.9951 3150.7800 3165.8015 3169.5757
redmass: 4.5551 12.1169 10.6435 6.3796 7.9230 2.4024 2.8146 6.3515 7.5628 6.0461 7.5694 2.9103 6.9409 5.2035 3.7321 5.1778 1.2512 1.6921 1.4604 1.3809 1.3878 2.9717 1.2281 1.1776 1.5391 2.0336 1.1605 3.0238 1.3060 4.9418 3.2314 1.1264 2.5699 6.7806 6.2117 12.6296 1.0574 1.0897 1.0896 1.1109 1.0962 1.0976
irintensity: 1.6875 1.9461 4.0324 2.1798 2.0977 1.1067 0.0123 0.1044 21.4337 12.1897 0.2650 65.6066 0.0717 8.3232 2.2969 10.2248 0.0898 61.6647 1.9196 0.9312 0.0307 3.2443 7.7766 2.6108 1.1066 3.9162 35.2768 23.6196 0.3946 0.2914 12.3787 6.8642 4.7272 0.1887 0.3932 28.5879 14.1433 3.7804 7.4872 2.7489 9.0823 0.2061
temp: 298.150 k
press: 1.00000 atm
elementType: 35 7 6 6 6 6 6 6 6 6 1 1 1 1 1 1
symmnumber: 1
zpe: 303008.3 jmol-1
zpe.correction: 0.115410 hartree
zpe.thermalcorrener: 0.124425 hartree
zpe.thermalcorrenthalpy: 0.125369 hartree
zpe.thermalcorrgfe: 0.078951 hartree
zpe.sumelectzpe: -375.955779 hartree
zpe.sumelectthermal: -375.946764 hartree
zpe.sumelectthermalent: -375.945820 hartree
zpe.sumelectthermalfe: -375.992238 hartree
dipole: 2.5204 0.0016 2.6867
dipole: 3.6838
quadrupole: -98.5525 -58.9023 -67.7508
quadrupole: -0.0049 -1.1269 -0.0031
quadrupole: -23.4839 16.1662 7.3177 -0.0049 -1.1269 -0.0031
hfenergy: -376.071189 hartree
pointgroup: C01 [X(C8H6Br1N1)]
dipole: 1.1259561 0.0006002 0.9125603 debye
dipolederiv: -0.6448731 0.0000456 0.1529318 0.000149 -0.1249309 -0.0000662 0.5319187 -0.0000704 -0.3733966 -0.4487367 0.0003687 -0.0023905 -0.0000727 -0.2198942 -0.0000006 -0.0273348 0.0000451 -0.2407933 -0.0508059 -0.0000045 0.0006717 -0.0000081 0.0366797 -0.000036 -0.1536519 -0.000035 -0.1164825 -0.1040514 0.1669299 0.0226026 0.0734328 0.0405917 0.0255433 0.0186196 0.0044807 -0.1210301 -0.1040768 -0.1669029 0.0226689 -0.0733298 0.0405892 -0.0256089 0.0186451 -0.0045532 -0.1210159 0.8664076 -0.0000889 -0.3079603 -0.0001503 0.1027275 0.0001164 -0.4941558 0.0001167 0.5451498 -0.0076471 -0.1313785 0.0178011 -0.0088228 0.0378217 0.0153631 0.005107 -0.0187054 -0.118979 -0.0077281 0.1313446 0.0177376 0.0086785 0.0377977 -0.0154543 0.0050922 0.0186257 -0.1189734 -0.0659617 0.0000066 0.0068477 0.0002199 0.1649871 0.0000118 -0.0223265 -0.0000089 0.1198272 0.4223281 -0.0003208 0.0249546 -0.0001088 -0.0609387 0.0000002 0.0578289 -0.000025 0.0243983 0.0286129 -0.0868495 -0.0237222 -0.0774303 -0.0202767 -0.0047246 -0.0081173 -0.0104473 0.1399708 0.028621 0.0868206 -0.0237611 0.0773987 -0.0202641 0.004796 -0.0081511 0.0105173 0.1399689 -0.0009578 -0.0078959 0.0561317 0.0662848 -0.0036744 0.0806545 0.0549804 0.0661931 -0.0414728 -0.0009571 0.0079242 0.0561254 -0.0662589 -0.0037423 -0.0806735 0.0550086 -0.0662113 -0.0414009 0.0449242 0.0699566 -0.0103345 0.0635577 -0.0037445 0.0053499 -0.0167453 0.0084506 0.1621112 0.0449019 -0.0699557 -0.0103044 -0.06354 -0.0037288 -0.005271 -0.0167178 -0.0083726 0.1621182 unknown
polarizability: 181.3933856|0.0087545|85.3198099|-9.1852605|-0.0028473|63.4788229 unknown
InChI: InChI=1S/C8H6BrN/c9-5-7-1-3-8(6-10)4-2-7/h1-4H,5H2
charge 0 multiplicity 1
16 atoms
Br 3.923109 -0.00036 -1.178942
N  -4.018166 -0.000853 -0.346834
C  1.412754 0.00011 0.382407
C  0.69808 1.223531 0.283045
C  0.697968 -1.223292 0.283596
C  2.894474 0.000115 0.603923
C  -0.695548 1.230808 0.093239
C  -0.695655 -1.230512 0.093797
C  -1.404193 0.000159 -0.001221
C  -2.831347 0.000205 -0.190117
H  1.241312 2.173338 0.346819
H  1.241122 -2.173114 0.347793
H  3.258191 -0.905561 1.109745
H  3.258248 0.906009 1.109302
H  -1.242923 2.175436 0.019131
H  -1.243125 -2.175119 0.020118
