program: Gaussian 09
title: 000087006
version: EM64L-G09RevD.01
frameworkgroup: C1[X(C20H26O)]
method: RPBEPBE
basis: SDD
operation: Freq
keyword: #pfreq=noraman
keyword: PBEPBE/SDD
title: #p freq=noraman PBEPBE/SDD
converged: YES YES NO NO
title: Mulliken charges:
elementType: O C C C C C C C C C C C C C C C C C C C C H H H H H H H H H H H H H H H H H H H H H H H H H H
charge: -0.466946 0.022069 -0.493821 -0.374072 -0.377121 -0.376139 0.387978 0.368693 -0.353645 -0.357309 -0.389703 -0.363286 -0.402195 -0.429354 -0.697156 -0.237708 -0.230380 -0.227542 -0.245611 -0.246337 -0.242681 0.204583 0.205689 0.210130 0.218382 0.187520 0.188047 0.193597 0.191402 0.187059 0.186493 0.195768 0.195078 0.342214 0.239501 0.266802 0.286054 0.249427 0.215154 0.209460 0.209243 0.222820 0.226334 0.223004 0.224571 0.225202 0.228732
chargesum: 0.00000
title: Mulliken charges with hydrogens summed into heavy atoms:
elementType: O C C C C C C C C C C C C C C C C C C C C
charge: -0.124732 0.022069 -0.083550 0.054440 -0.001554 0.008861 0.387978 0.368693 0.019907 0.033537 -0.150202 -0.096484 -0.116141 -0.179927 -0.063298 -0.014889 -0.004047 -0.004538 -0.021040 -0.021135 -0.013949
polarizability: 2.32398329e+02 -1.59811281e+01 2.25889549e+02 -5.91517048e+00 1.49003315e+01 1.78459421e+02
1716.lowfreq: -9.9664 -0.0005 0.0005 0.0008 0.9558 5.5488 17.9273 30.9412 34.5413
frequency: 17.0425 30.7422 34.4925 38.2901 44.0117 59.5800 69.8633 94.8813 108.0295 125.6216 139.6680 168.9778 180.5724 208.2374 220.7949 233.3184 254.8128 284.8514 290.7101 318.6716 343.4014 360.9888 400.3042 403.2375 404.3872 438.1656 471.9684 499.1146 544.0482 601.4873 615.9496 616.5907 637.9597 703.1798 705.3808 709.5687 721.2675 735.0488 762.5576 766.4410 781.5943 815.9659 854.3910 859.9514 864.9655 887.3081 899.9118 922.4637 933.9563 945.7949 980.4898 982.3958 988.8576 990.6466 994.3517 997.8463 999.3248 1004.4355 1023.5696 1026.7615 1034.5573 1042.5393 1061.2723 1079.5391 1080.7670 1081.9331 1101.7352 1117.9110 1123.6685 1152.3730 1170.8954 1172.0486 1188.2846 1189.6061 1189.8006 1196.4964 1223.5166 1234.1418 1264.5799 1273.4806 1282.4908 1291.1076 1294.8366 1309.7794 1312.9977 1317.9295 1337.2397 1347.4213 1354.4530 1358.4752 1380.1821 1381.3052 1387.1120 1433.1705 1434.1555 1453.2008 1460.7606 1461.3342 1467.9569 1475.9169 1477.3254 1480.0463 1481.0700 1484.0906 1488.1020 1589.1007 1591.4431 1608.9396 1612.7963 2944.6393 2949.8537 2956.4323 2957.6390 2967.3751 2970.9066 2983.1279 2985.2744 2992.3333 3011.5449 3015.6103 3033.3531 3054.3573 3067.6402 3069.7853 3117.0436 3122.7680 3125.7341 3132.0119 3139.3240 3146.9430 3154.5486 3157.3311 3165.6503 3178.7307 3561.5116
redmass: 2.8755 2.5090 4.1047 2.5697 3.9572 4.2996 3.3207 2.0740 2.7307 2.6712 2.1185 4.2657 2.7265 4.3999 3.8885 1.1151 3.9527 3.5785 1.3737 3.3530 3.0333 3.4949 3.3622 3.1309 2.8697 3.8619 3.0569 3.3814 3.9849 3.7421 6.3851 6.3792 5.3792 4.1277 1.6823 1.8481 1.0645 1.0924 1.4860 1.4731 2.0209 1.4548 1.2946 1.2498 1.9902 1.8939 1.9981 1.4729 1.4883 1.8035 1.3808 1.4046 5.3894 5.7416 2.9962 1.3907 1.3285 1.3894 2.8784 2.2794 2.7652 2.8880 2.6210 2.0868 1.5663 2.2635 1.9696 1.9093 1.9952 1.8949 1.0546 1.0528 1.1804 1.4791 1.3664 2.3109 1.3759 1.3981 1.3305 1.2905 1.0377 1.2231 1.0889 1.3335 1.3421 1.3508 1.4884 1.5372 1.6859 1.6265 6.8519 8.5961 1.2176 2.2115 2.2278 1.0939 1.0690 1.0742 1.0759 1.0877 1.0432 2.2158 2.0461 1.1198 1.0926 6.0668 6.3226 6.0346 6.0540 1.0589 1.0588 1.0600 1.0594 1.0585 1.0366 1.0971 1.0592 1.1001 1.1006 1.1011 1.1046 1.1040 1.1007 1.0992 1.0853 1.0846 1.0879 1.0881 1.0937 1.0923 1.0951 1.0991 1.1009 1.0950 1.0658
irintensity: 0.0083 0.0797 0.0384 0.1702 0.1704 0.1048 0.1266 0.0784 0.0834 0.1498 0.0953 1.9206 0.5568 0.3566 0.6666 0.0002 3.0884 9.2692 102.2476 23.5923 47.9770 5.8345 2.5231 5.6586 0.3835 3.9080 0.0934 1.0002 4.3534 24.5067 0.6049 0.4535 22.0901 5.9555 58.4620 60.1677 12.1561 0.3409 42.1162 14.2018 35.2529 5.5755 0.6409 0.1354 12.1258 2.2545 10.9168 10.4611 3.3512 20.3962 0.2328 0.2756 0.4072 0.4096 1.9469 0.6381 1.6522 7.3295 5.6065 11.7856 5.4768 12.5664 4.7959 1.3579 3.2862 3.1794 4.7714 12.4408 16.7849 37.0699 0.2332 0.0120 5.4464 1.0701 5.0284 5.4800 18.3693 5.0968 4.0041 4.6536 0.3915 2.1704 1.1169 0.9530 1.3439 1.6013 16.9675 14.4352 0.7996 5.9567 1.7684 2.4512 10.9256 5.3627 23.1771 0.6756 0.2191 0.0179 0.8784 1.5136 11.9467 20.6850 8.5807 4.0784 24.2071 1.8363 0.2620 7.3171 3.0941 4.6074 1.8123 2.9462 54.2329 99.6285 37.5340 2.5775 42.7408 1.6507 7.7368 5.8143 53.6383 83.5494 99.2562 54.7404 4.2021 1.0095 3.7403 7.4382 34.3617 24.7932 29.8643 31.1607 17.2323 6.1584 6.6695
temp: 298.150 k
press: 1.00000 atm
elementType: 8 6 6 6 6 6 6 6 6 6 6 6 6 6 6 6 6 6 6 6 6 1 1 1 1 1 1 1 1 1 1 1 1 1 1 1 1 1 1 1 1 1 1 1 1 1 1
symmnumber: 1
zpe: 1061174.7 jmol-1
zpe.correction: 0.404180 hartree
zpe.thermalcorrener: 0.425825 hartree
zpe.thermalcorrenthalpy: 0.426769 hartree
zpe.thermalcorrgfe: 0.350615 hartree
zpe.sumelectzpe: -851.378758 hartree
zpe.sumelectthermal: -851.357114 hartree
zpe.sumelectthermalent: -851.356170 hartree
zpe.sumelectthermalfe: -851.432324 hartree
dipole: 0.1320 -1.3994 -0.6710
dipole: 1.5575
quadrupole: -126.1160 -120.4235 -123.9439
quadrupole: -3.4848 -1.4874 0.1095
quadrupole: -2.6215 3.0709 -0.4495 -3.4848 -1.4874 0.1095
hfenergy: -851.7829384 hartree
pointgroup: C01 [X(C20H26O1)]
dipole: 0.0495512 0.5448095 0.276097 debye
polarizability: 232.2754563|15.7859063|225.2841138|6.4860189|16.0009288|179.1877281 unknown
InChI: InChI=1S/C20H26O/c1-2-3-4-5-12-17-20(21,18-13-8-6-9-14-18)19-15-10-7-11-16-19/h6-11,13-16,21H,2-5,12,17H2,1H3
charge 0 multiplicity 1
47 atoms
O  0.834347 0.319181 -2.008052
C  0.952019 0.298375 -0.521687
C  -0.352349 0.893042 0.08926
C  -1.6417 0.163018 -0.340853
C  -2.915552 0.88689 0.149744
C  -4.216843 0.148072 -0.236192
C  1.101037 -1.184315 -0.133547
C  2.218468 1.094705 -0.133397
C  -5.497325 0.878682 0.226927
C  -6.798033 0.132928 -0.149841
C  1.449994 -1.526693 1.197209
C  3.434274 0.776374 -0.797447
C  0.862436 -2.218251 -1.070012
C  2.228243 2.124589 0.839461
C  -8.072875 0.873014 0.309977
C  1.551573 -2.879382 1.588314
C  4.624688 1.469757 -0.499461
C  0.970203 -3.573222 -0.679971
C  3.422668 2.821547 1.140952
C  1.311094 -3.910392 0.649555
C  4.624111 2.498304 0.47391
H  -0.278628 0.867762 1.194663
H  -0.420667 1.962099 -0.204482
H  -1.660187 0.078416 -1.444936
H  -1.631501 -0.871971 0.052859
H  -2.876236 1.002637 1.253828
H  -2.941289 1.915312 -0.269382
H  -4.199149 -0.873144 0.19852
H  -4.248541 0.015115 -1.337901
H  -5.463404 1.018866 1.327973
H  -5.519736 1.897254 -0.214741
H  -6.776798 -0.882541 0.296003
H  -6.828805 -0.01175 -1.249233
H  0.879952 1.266582 -2.295144
H  1.661938 -0.734211 1.925313
H  3.430368 -0.021978 -1.54737
H  0.603036 -1.949216 -2.097096
H  1.30935 2.395143 1.368989
H  -8.98798 0.319328 0.029613
H  -8.080197 1.003836 1.408761
H  -8.133178 1.879124 -0.146741
H  1.826034 -3.128834 2.619719
H  5.552986 1.20927 -1.020581
H  0.78609 -4.364938 -1.415507
H  3.411742 3.615642 1.896333
H  1.393606 -4.961059 0.950327
H  5.548614 3.037832 0.708565
