program: Gaussian 09
title: 000086972
version: EM64L-G09RevD.01
frameworkgroup: C1[X(C11H18OSi)]
method: RPBEPBE
basis: SDD
operation: Freq
keyword: #p
keyword: freq=noraman
keyword: PBEPBE/SDD
title: #p freq=noraman PBEPBE/SDD
converged: YES YES NO NO
title: Mulliken charges:
elementType: Si O C C C C C C C C C C C H H H H H H H H H H H H H H H H H H
charge: 1.390226 -0.596479 -0.976198 -1.045113 -1.050718 0.494461 -0.201114 -0.438241 -0.361571 -0.663488 -0.220893 -0.233730 -0.249518 0.264251 0.238883 0.246244 0.237302 0.238595 0.234917 0.237612 0.265545 0.189167 0.189883 0.226149 0.270291 0.197169 0.223592 0.226041 0.221001 0.221234 0.224500
chargesum: 0.00000
title: Mulliken charges with hydrogens summed into heavy atoms:
elementType: Si O C C C C C C C C C C C
charge: 1.390226 -0.596479 -0.473064 -0.322972 -0.312644 0.494461 0.177936 -0.212092 -0.091280 -0.016687 0.000108 -0.012496 -0.025018
polarizability: 1.72570400e+02 5.27219230e+00 1.51110607e+02 1.50306098e+01 2.82502806e+00 1.03656048e+02
1716.lowfreq: -9.6364 -5.7914 -0.0010 0.0010 0.0015 6.8274 19.6957 32.4618 41.4916
frequency: 19.6610 32.3541 41.4492 47.5382 67.8252 87.9791 101.1658 121.9109 158.2469 171.8841 196.1404 213.5091 242.9461 270.9627 294.5064 328.1139 372.0966 404.3174 471.4530 555.0203 582.3378 616.3711 659.4241 687.1672 700.3115 703.9570 758.2167 766.8248 796.5718 806.4221 809.3434 833.0574 852.8902 889.8519 904.6183 921.5189 933.8887 974.6388 988.3851 991.9901 1027.6769 1060.9620 1066.5465 1103.0138 1131.5331 1134.0757 1170.2961 1187.3337 1190.9433 1219.4629 1261.9059 1295.6721 1303.3804 1327.9078 1362.5976 1378.9888 1388.0169 1431.6683 1437.9484 1441.6178 1443.6013 1447.7926 1453.4468 1457.6647 1476.8027 1481.3705 1490.0753 1588.9474 1611.6922 2925.5756 2974.3429 2979.9755 2982.4810 2984.7703 2987.7990 3047.6376 3078.8230 3081.4301 3085.6036 3089.1189 3093.7684 3098.9894 3112.0661 3120.7741 3133.9985 3144.2507 3159.9957
redmass: 3.4549 2.3138 2.7655 3.1843 2.5507 1.1763 2.7796 1.0400 3.3818 2.9108 2.6599 3.5084 1.4958 2.3829 3.0762 2.2460 3.2789 2.8337 3.5300 4.6961 3.7578 6.1500 3.6404 3.3484 2.6098 1.7766 1.6640 1.5340 1.3642 2.3786 1.3032 1.8332 1.2500 1.6939 1.5104 1.4903 2.6039 1.4129 3.8473 1.4689 2.2186 3.8471 1.6649 2.1164 1.1278 1.4605 1.0515 1.2639 1.1501 3.2072 1.1348 1.2054 1.1956 1.2708 1.2526 7.8322 1.2559 1.2659 1.1818 1.1064 1.3939 1.0500 1.0518 1.0420 1.0489 2.2879 1.0811 6.0359 6.0508 1.0549 1.1043 1.0367 1.0364 1.0573 1.0357 1.0999 1.0978 1.0972 1.0987 1.0984 1.0985 1.1012 1.0862 1.0864 1.0921 1.0959 1.1016
irintensity: 0.0108 0.4388 0.0890 2.6578 1.6953 0.4293 0.3177 0.0340 1.3159 0.7289 1.2411 3.8204 2.2373 12.9707 9.6581 6.2007 4.3719 0.1250 18.0510 4.1517 8.2354 1.0997 23.5189 12.8290 11.4279 49.9932 20.1883 10.7560 21.8026 4.0082 0.5308 85.4781 1.3378 82.5256 108.8390 25.2326 153.3114 0.7321 0.7166 0.7315 9.5506 229.6437 4.4039 11.0311 1.2339 5.1123 0.2112 17.6236 9.2660 30.3656 1.0284 50.2929 35.8597 1.0041 16.5541 0.5896 29.6681 5.6753 1.4441 3.4865 9.5916 10.4360 13.4294 11.0251 10.0575 32.9802 4.2692 1.0749 21.7867 72.6023 39.4077 16.6937 14.9222 19.4163 28.3213 7.7721 0.9616 30.8826 46.7635 14.8700 12.5990 39.9055 9.0324 0.3752 25.1750 30.7408 26.2105
temp: 298.150 k
press: 1.00000 atm
elementType: 14 8 6 6 6 6 6 6 6 6 6 6 6 1 1 1 1 1 1 1 1 1 1 1 1 1 1 1 1 1 1
symmnumber: 1
zpe: 680861.8 jmol-1
zpe.correction: 0.259327 hartree
zpe.thermalcorrener: 0.275817 hartree
zpe.thermalcorrenthalpy: 0.276761 hartree
zpe.thermalcorrgfe: 0.212819 hartree
zpe.sumelectzpe: -793.620913 hartree
zpe.sumelectthermal: -793.604423 hartree
zpe.sumelectthermalent: -793.603479 hartree
zpe.sumelectthermalfe: -793.667421 hartree
dipole: -1.4079 -1.0065 1.0163
dipole: 2.0070
quadrupole: -81.8969 -80.7943 -89.8019
quadrupole: -0.7808 0.5636 1.3463
quadrupole: 2.2674 3.3701 -5.6375 -0.7808 0.5636 1.3463
hfenergy: -793.8802399 hartree
pointgroup: C01 [X(C11H18O1Si1)]
dipole: -0.5863663 0.3959017 -0.3506451 debye
polarizability: 170.8714505|-3.7562393|150.5450698|-19.1484354|4.5471213|105.9205343 unknown
InChI: InChI=1S/C11H18OSi/c1-4-12-13(2,3)10-11-8-6-5-7-9-11/h5-9H,4,10H2,1-3H3
charge 0 multiplicity 1
31 atoms
Si -1.58311 1.062475 0.062803
O  -2.08391 -0.593692 0.35931
C  0.019575 1.195824 1.112592
C  -2.917905 2.264979 0.712963
C  -1.265974 1.334484 -1.797113
C  1.227397 0.503035 0.504201
C  -3.228859 -1.242947 -0.283991
C  2.339483 1.248711 0.032315
C  1.263875 -0.913683 0.381559
C  -3.254273 -2.708882 0.155924
C  3.459278 0.602465 -0.541135
C  2.383339 -1.560472 -0.186715
C  3.487241 -0.806473 -0.651422
H  -0.232483 0.747672 2.094229
H  0.232853 2.26674 1.293522
H  -3.101729 2.09926 1.78998
H  -2.602787 3.316566 0.576703
H  -3.877471 2.132441 0.179555
H  -2.18708 1.19849 -2.39348
H  -0.892726 2.358679 -1.984672
H  -0.504628 0.624339 -2.165659
H  -4.172269 -0.735189 0.014513
H  -3.140275 -1.173974 -1.390385
H  2.331496 2.342463 0.121509
H  0.401317 -1.496463 0.725241
H  -4.111602 -3.239879 -0.299037
H  -2.322111 -3.214856 -0.150078
H  -3.33924 -2.775484 1.254378
H  4.30905 1.197721 -0.895462
H  2.395006 -2.65381 -0.268072
H  4.355821 -1.309642 -1.091175
