program: Gaussian 09
title: 000086957
version: EM64L-G09RevD.01
frameworkgroup: C1[X(C8H8O4)]
method: RPBEPBE
basis: SDD
operation: Freq
keyword: #p
keyword: freq=noraman
keyword: PBEPBE/SDD
title: #p freq=noraman PBEPBE/SDD
converged: YES YES NO NO
title: Mulliken charges:
elementType: O O O O C C C C C C C C H H H H H H H H
charge: -0.443368 -0.435136 -0.403151 -0.233286 0.405131 -0.264100 -0.509510 -0.393393 0.319430 -0.180553 -0.409101 0.165588 0.274095 0.290943 0.260244 0.225909 0.222139 0.365587 0.354266 0.388265
chargesum: 0.00000
title: Mulliken charges with hydrogens summed into heavy atoms:
elementType: O O O O C C C C C C C C
charge: -0.077781 -0.080870 -0.014886 -0.233286 0.405131 0.009995 -0.218567 -0.133148 0.319430 0.045356 -0.186961 0.165588
polarizability: 1.25102877e+02 -2.35095240e+00 1.06809294e+02 5.11740048e+00 -4.86238671e+00 5.73463167e+01
1716.lowfreq: -7.0442 -4.5888 0.0009 0.0009 0.0010 5.4014 24.6857 62.2288 111.9383
frequency: 24.4798 62.2226 111.9334 173.1583 218.2476 223.2739 275.2883 348.3456 358.9199 375.7157 412.5702 433.1884 450.8339 519.7111 543.9249 563.9216 604.8062 637.9796 682.8327 692.1252 765.0753 791.4232 844.1797 881.9092 922.0622 945.0353 965.0107 984.0692 1011.5880 1064.2806 1093.1432 1124.0953 1156.9715 1181.7354 1211.1707 1243.9634 1265.2309 1298.0343 1301.7746 1377.8845 1398.8752 1464.3709 1474.2017 1593.7923 1625.5718 1649.8724 3042.8427 3116.6518 3142.8351 3164.6925 3182.5424 3480.7696 3505.8798 3581.7293
redmass: 6.1946 10.5249 5.3462 6.4514 5.5361 4.4125 5.0620 8.5618 1.1154 1.2405 3.4696 4.0584 3.0260 6.5696 2.7352 4.4570 2.6537 2.6076 3.6345 2.6882 2.0781 2.7047 2.7236 1.5574 1.5425 3.3691 1.3286 6.0137 5.3102 2.2706 1.7074 1.5684 1.4363 1.1360 1.3118 1.5078 2.3825 1.3841 1.7317 1.6594 4.1657 2.7061 2.5597 6.7230 6.3901 8.7105 1.0845 1.0886 1.0906 1.0977 1.0916 1.0652 1.0641 1.0660
irintensity: 0.3625 1.8993 1.8889 4.2944 4.0120 1.9302 12.1240 15.6967 148.2310 144.6176 12.9626 2.0691 2.5799 5.0137 33.6071 7.4254 95.2509 57.7581 61.4567 27.5916 50.0491 20.5403 22.0866 3.0152 19.8320 43.1670 1.6695 4.1363 158.9931 175.3843 1.5539 69.0985 111.1225 9.5813 19.0579 12.4581 64.2303 30.4415 40.9271 35.5190 11.6721 40.7978 19.9242 54.9880 71.4116 207.5327 7.9806 13.1543 12.8746 10.5820 3.2006 34.0504 28.5742 35.2193
temp: 298.150 k
press: 1.00000 atm
elementType: 8 8 8 8 6 6 6 6 6 6 6 6 1 1 1 1 1 1 1 1
symmnumber: 1
zpe: 386194.9 jmol-1
zpe.correction: 0.147094 hartree
zpe.thermalcorrener: 0.158178 hartree
zpe.thermalcorrenthalpy: 0.159122 hartree
zpe.thermalcorrgfe: 0.109325 hartree
zpe.sumelectzpe: -609.655666 hartree
zpe.sumelectthermal: -609.644581 hartree
zpe.sumelectthermalent: -609.643637 hartree
zpe.sumelectthermalfe: -609.693435 hartree
dipole: 0.9840 3.6039 0.9318
dipole: 3.8502
quadrupole: -53.1646 -68.8039 -74.1487
quadrupole: -2.6393 2.0788 0.1229
quadrupole: 12.2078 -3.4315 -8.7763 -2.6393 2.0788 0.1229
hfenergy: -609.8027594 hartree
pointgroup: C01 [X(C8H8O4)]
dipole: -0.6607966 -0.810824 1.095687 debye
dipolederiv: -0.7273119 -0.0208564 0.1232417 -0.10378 -0.438053 0.1949711 0.1787026 0.2014829 -0.4105483 -0.6066243 0.5378193 -0.3089328 0.6320272 -0.9266539 0.1590601 -0.3350995 0.1559421 -0.4369073 -0.4479558 0.1927701 -0.0187845 0.1700787 -0.936798 0.3454062 -0.053892 0.4270028 -0.4962034 -0.6126011 -0.2468754 -0.1275188 -0.2568434 -0.8022308 0.0807201 -0.3519686 -0.1024368 -0.515395 0.2721943 -0.0717804 0.0542242 -0.0159803 0.1128333 -0.0884724 -0.1925125 -0.0697829 -0.0907162 0.2304535 0.0317002 -0.2729316 0.1872556 0.3761472 -0.1731104 -0.2534483 -0.0808741 0.2554162 -0.3738182 0.2588411 -0.1586189 -0.0106129 -0.1687695 -0.0014481 0.0341325 -0.0901071 -0.0857971 -0.2886144 -0.0993296 0.0567809 -0.059411 -0.1414451 -0.0296375 0.0510146 -0.0217388 -0.1833688 0.6350395 -0.5925708 0.2297405 -0.6449898 0.8088375 -0.2821808 0.2570332 -0.2769065 0.2038872 0.17881 0.0158709 -0.0868304 -0.0926729 0.0750956 -0.088389 -0.020367 -0.1226693 -0.0395088 -0.0481991 -0.0695453 -0.0228994 0.2063345 -0.3150359 0.0116327 -0.1807701 0.0788435 -0.2202992 0.7586132 0.1744636 0.3703009 0.178303 1.3327665 -0.2724034 0.7183127 -0.2055815 0.7137697 0.0087249 0.0144831 0.0410487 0.0070053 -0.0567311 -0.015153 0.0491824 -0.0243061 0.0546049 0.1541459 -0.0263266 0.0279775 -0.0235994 0.0699306 0.0603294 0.0132017 0.0681426 0.1185777 0.069865 0.0893221 -0.0096532 0.0798443 0.0355066 0.0635904 -0.0176541 0.0623097 0.1220038 0.0409699 -0.0530083 0.0584891 -0.0556675 -0.006209 0.1105392 0.069058 0.1126254 0.0677703 -0.1249084 0.042023 0.0573404 0.0595864 0.0982168 0.0330504 0.0494369 0.0365091 0.14023 0.3978451 -0.0276176 -0.009149 -0.005928 0.2391199 -0.0944757 -0.0385698 -0.1616856 0.2602573 0.1741065 -0.0812805 0.1131795 -0.1330963 0.3406926 0.0611586 0.142348 0.0517875 0.3127931 0.3092653 -0.0681024 -0.1170048 -0.1178535 0.3027797 -0.075188 -0.1181405 -0.0385569 0.2294338 unknown
polarizability: 123.184764|-7.8407504|95.5631304|-0.9132938|-22.9685183|70.5105939 unknown
InChI: InChI=1S/C8H8O4/c9-6-3-1-2-5(4-6)7(10)8(11)12/h1-4,7,9-11H
charge 0 multiplicity 1
20 atoms
O  1.865522 0.665695 -1.6348
O  -2.886721 1.878199 -0.847496
O  2.491663 -1.557275 1.172288
O  2.994576 0.693763 0.873023
C  0.006831 -0.353715 -0.308124
C  1.490268 -0.409591 -0.732805
C  -0.790726 0.721163 -0.747041
C  -0.556509 -1.383064 0.490818
C  -2.153222 0.775674 -0.375254
C  -1.919407 -1.317724 0.849286
C  -2.728646 -0.239791 0.424481
C  2.399028 -0.343582 0.504458
H  1.684781 -1.357413 -1.264347
H  -0.37106 1.496317 -1.392708
H  0.06345 -2.218974 0.829768
H  -2.359244 -2.11077 1.463852
H  -3.788154 -0.195515 0.708403
H  2.241411 1.408169 -1.086722
H  -3.828649 1.83019 -0.548499
H  3.058108 -1.457255 1.985519
