program: Gaussian 09
title: 000086955
version: EM64L-G09RevD.01
frameworkgroup: C1[X(C5H9OPS3)]
method: RPBEPBE
basis: SDD
operation: Freq
keyword: #p
keyword: freq=noraman
keyword: PBEPBE/SDD
title: #p freq=noraman PBEPBE/SDD
converged: YES YES NO NO
title: Mulliken charges:
elementType: S S S P O C C C C C H H H H H H H H H
charge: 0.024800 0.006507 0.006488 0.496443 -0.560454 -0.750102 -0.824237 -0.824198 0.263327 -0.437449 0.307655 0.307585 0.298517 0.280398 0.273297 0.298471 0.273299 0.280448 0.279206
chargesum: 0.00000
title: Mulliken charges with hydrogens summed into heavy atoms:
elementType: S S S P O C C C C C
charge: 0.024800 0.006507 0.006488 0.496443 -0.560454 -0.134863 0.027975 0.028021 0.263327 -0.158243
polarizability: 1.79676348e+02 4.66547740e-02 1.57424341e+02 3.35346462e+00 9.17677036e-03 1.13735157e+02
1716.lowfreq: -28.7330 -5.0852 -1.1655 -0.0021 -0.0021 0.0017 4.7286 19.8566 37.5890
frequency: -28.6413 19.7950 37.5879 74.8681 75.2271 82.5795 96.6100 101.6395 116.2857 149.3265 152.9106 178.1864 207.2979 237.0192 254.0182 320.8734 330.6947 407.9584 424.2039 433.8776 635.9158 637.0807 638.7217 646.4083 669.4568 889.1173 965.7986 967.7261 978.5910 982.2467 986.1112 1005.0784 1156.9045 1247.5127 1343.9328 1346.6898 1440.3111 1441.1092 1444.4221 1455.3182 1457.0476 2143.0806 3008.1202 3015.6077 3015.8290 3078.2325 3138.3708 3138.5897 3149.6042 3149.8032 3425.1068
redmass: 3.6791 5.2428 2.8834 2.9656 6.7346 4.7873 1.1907 1.0891 4.9924 5.9192 5.7150 5.1066 13.5683 12.5094 9.5856 3.0248 13.7442 9.8491 26.4863 17.6400 1.2314 7.5290 7.4995 3.5574 1.5366 1.4567 1.2050 4.5207 1.2481 1.1728 1.1886 11.6866 1.0720 1.1913 1.1198 1.1205 1.0503 1.0520 1.0936 1.0559 1.0563 6.0412 1.0557 1.0279 1.0280 1.1076 1.1041 1.1043 1.1063 1.1063 1.1591
irintensity: 0.1847 0.0772 4.5464 0.5854 1.5518 1.2229 0.0583 0.1231 12.3414 1.5284 6.0818 0.1666 1.8558 8.9448 0.0484 8.2813 11.9580 29.3058 111.5531 105.8816 70.3291 3.7873 4.5846 6.5952 74.8514 0.5887 11.1033 22.3265 11.7713 0.8020 6.5106 51.6045 0.1309 11.9792 0.0472 5.4030 0.7335 26.9774 21.9541 36.1474 8.8247 0.0265 8.1056 19.3282 4.6143 0.2291 0.7381 5.0573 0.0458 8.1818 80.0139
temp: 298.150 k
press: 1.00000 atm
elementType: 16 16 16 15 8 6 6 6 6 6 1 1 1 1 1 1 1 1 1
symmnumber: 1
zpe: 336741.6 jmol-1
zpe.correction: 0.128258 hartree
zpe.thermalcorrener: 0.143483 hartree
zpe.thermalcorrenthalpy: 0.144427 hartree
zpe.thermalcorrgfe: 0.082991 hartree
zpe.sumelectzpe: -1805.700423 hartree
zpe.sumelectthermal: -1805.685199 hartree
zpe.sumelectthermalent: -1805.684255 hartree
zpe.sumelectthermalfe: -1805.745690 hartree
dipole: 1.8279 -0.0044 -1.0990
dipole: 2.1328
quadrupole: -89.4575 -74.4348 -99.4469
quadrupole: 0.0205 0.5887 0.0045
quadrupole: -1.6777 13.3449 -11.6672 0.0205 0.5887 0.0045
hfenergy: -1805.8286816 hartree
pointgroup: C01 [X(C5H9O1P1S3)]
dipole: 0.7412245 -0.0010177 -0.3933361 debye
dipolederiv: -0.7533555 0.0002517 -0.083197 0.0004012 -0.3057949 0.0000585 -0.1351539 0.0001174 -0.204253 -0.3093977 -0.0179062 0.0157277 -0.1191778 -0.5585104 -0.0503317 -0.1994745 -0.2358938 -0.2673536 -0.3095037 0.0177799 0.0157705 0.1193803 -0.5584811 0.0502496 -0.1993577 0.2358476 -0.2673522 1.5690294 -0.0001649 0.0901231 -0.0002544 1.5769484 -0.0000405 0.5777967 -0.000096 0.9257798 -0.773027 -0.0000199 0.1034673 0.0000222 -0.6029675 0.000052 0.0832273 0.000026 -0.5865692 0.4329848 0.0002052 -0.105886 -0.000252 0.1138345 0.0000061 -0.5096356 0.0003512 0.1525604 0.0351162 0.0129839 -0.0046147 0.0263977 0.065452 -0.0743261 -0.0346139 -0.2034195 0.0387218 0.0350681 -0.0129204 -0.0046783 -0.0263212 0.0652843 0.0742767 -0.0345651 0.2034186 0.0388234 -0.01248 0.0002299 0.0337833 0.0004501 -0.0479513 -0.0000438 0.2065721 -0.0000693 -0.1033262 -0.5039492 -0.0000886 0.0183063 -0.0005452 -0.2859039 0.000102 -0.0044433 0.0000794 -0.2475778 0.0289025 -0.0368066 -0.0191359 -0.0066073 0.0333065 -0.0482705 0.0837766 -0.0403696 0.0225496 0.0291822 0.0364802 -0.0197072 0.0064665 0.0341407 0.0482447 0.083314 0.0401238 0.022129 0.0174562 0.0157394 0.0616332 0.0441015 0.0744471 0.0010906 0.1044042 0.0909587 0.0338569 -0.0220806 0.0067172 -0.0737832 -0.006003 0.0802308 0.0189159 -0.0486773 0.1100284 0.0162279 0.1408283 -0.0211275 -0.0048193 -0.0235048 -0.049384 -0.0447839 -0.0045793 -0.0056287 0.0646097 0.0173843 -0.0157403 0.0616746 -0.0440509 0.0744206 -0.0011054 0.1044016 -0.0909965 0.0337705 0.1408476 0.0210701 -0.0047953 0.023396 -0.0494042 0.0447445 -0.0045628 0.0055442 0.0646363 -0.0220604 -0.0066132 -0.0737566 0.0060589 0.0803414 -0.0188079 -0.0487006 -0.1099792 0.0162447 0.2590546 -0.0000698 -0.0061124 0.0000423 0.2599909 -0.0000308 -0.0197282 -0.0000428 0.246522 unknown
polarizability: 179.1298654|0.0633719|157.4244278|6.853955|0.0250052|114.281553 unknown
InChI: InChI=1S/C3H3S.2CH3S.OP/c1-2-3-4;3*1-2/h1H,3H2;2*1H3;
charge 0 multiplicity 1
19 atoms
S  0.872956 -0.000034 1.179681
S  -1.349132 -1.755042 -1.213147
S  -1.348996 1.755948 -1.212505
P  -1.266921 0.000126 0.286594
O  -2.349482 -0.000178 1.461594
C  1.823415 -0.002809 -0.4966
C  -1.517476 -3.113392 0.096193
C  -1.516111 3.113996 0.097325
C  3.256533 0.000583 -0.227973
C  4.470045 0.003384 -0.007711
H  1.50885 -0.905531 -1.047939
H  1.505242 0.895845 -1.052738
H  -2.412649 -2.928317 0.706818
H  -0.613754 -3.151257 0.722679
H  -1.628302 -4.051609 -0.469692
H  -2.411292 2.929324 0.70807
H  -1.626479 4.052478 -0.468205
H  -0.612239 3.150985 0.723621
H  5.528691 0.0054 0.179535
