program: Gaussian 09
title: 000086937
version: EM64L-G09RevD.01
frameworkgroup: C1[X(C7H8Cl3NSi)]
method: RPBEPBE
basis: SDD
operation: Freq
keyword: #p
keyword: freq=noraman
keyword: PBEPBE/SDD
title: #p freq=noraman PBEPBE/SDD
converged: YES YES NO NO
title: Mulliken charges:
elementType: Cl Cl Cl Si N C C C C C C C H H H H H H H H
charge: -0.232045 -0.236601 -0.236605 0.828277 -0.000149 -0.478510 -0.839835 0.502147 -0.347088 -0.347105 -0.326579 -0.326573 0.238198 0.238300 0.300851 0.300940 0.238224 0.238207 0.242977 0.242969
chargesum: 0.00000
title: Mulliken charges with hydrogens summed into heavy atoms:
elementType: Cl Cl Cl Si N C C C C C C C
charge: -0.232045 -0.236601 -0.236605 0.828277 -0.000149 -0.002012 -0.238044 0.502147 -0.108864 -0.108898 -0.083603 -0.083603
polarizability: 1.59927268e+02 2.59704879e-02 1.31470890e+02 4.60501401e+00 -1.45388648e-02 9.72595810e+01
1716.lowfreq: -4.0385 0.0011 0.0020 0.0029 8.6794 13.9034 24.1129 34.5762 52.4129
frequency: 23.5045 34.3677 52.2984 62.0668 95.7723 133.3014 135.7166 170.3906 200.8622 250.2653 282.6412 335.3658 366.3388 388.7434 499.7736 501.1735 531.4793 575.1214 662.5239 733.5629 763.2191 767.3110 801.9212 851.6703 887.2466 950.7191 960.7112 965.9874 977.4176 1004.4494 1061.9208 1079.3315 1139.3839 1218.0700 1228.1976 1252.2919 1277.5240 1313.3860 1339.5957 1340.7055 1404.5351 1413.0123 1465.6209 1486.3666 1560.1305 1586.7969 2999.6185 3008.6704 3055.3064 3077.2089 3126.3777 3126.8067 3146.6421 3153.3663
redmass: 4.7692 5.5225 11.5670 4.0377 9.7752 14.6117 8.2984 14.3411 3.2919 15.2304 5.1917 2.5182 2.4828 12.6983 13.8369 5.9267 7.1246 5.8597 6.9256 4.6189 3.4135 1.2296 2.2135 2.1935 1.2474 1.5829 6.2839 1.4304 1.4934 4.5688 2.2112 1.5471 1.1059 1.4189 2.3444 1.2439 1.4000 4.0440 1.3382 1.2350 2.0021 1.0736 2.0101 1.0925 6.6522 5.6985 1.0595 1.0582 1.1024 1.1030 1.0865 1.0889 1.0962 1.0996
irintensity: 0.8592 1.7854 2.5969 0.0013 0.4762 4.9873 1.4572 8.1716 1.6152 5.6669 1.4499 0.1003 0.0025 48.6263 96.4868 81.5084 39.3770 42.5692 0.6809 33.4795 29.7746 32.7212 44.5081 11.3680 0.1747 17.5795 1.4180 0.9960 0.0136 6.4387 3.8447 0.7452 11.0676 1.1839 3.1369 24.9253 0.0404 0.2896 2.7104 0.9662 19.0864 7.8975 7.7116 10.4892 13.4275 59.5095 5.7594 10.0627 3.6288 3.9466 2.1922 11.2089 48.8173 0.7078
temp: 298.150 k
press: 1.00000 atm
elementType: 17 17 17 14 7 6 6 6 6 6 6 6 1 1 1 1 1 1 1 1
symmnumber: 1
zpe: 363825.0 jmol-1
zpe.correction: 0.138574 hartree
zpe.thermalcorrener: 0.151859 hartree
zpe.thermalcorrenthalpy: 0.152803 hartree
zpe.thermalcorrgfe: 0.094844 hartree
zpe.sumelectzpe: -1995.082799 hartree
zpe.sumelectthermal: -1995.069514 hartree
zpe.sumelectthermalent: -1995.068570 hartree
zpe.sumelectthermalfe: -1995.126529 hartree
dipole: 0.8227 -0.0058 -0.1606
dipole: 0.8382
quadrupole: -127.9375 -95.1174 -104.0427
quadrupole: -0.0114 -2.7353 -0.0085
quadrupole: -18.9050 13.9151 4.9898 -0.0114 -2.7353 -0.0085
hfenergy: -1995.2213731 hartree
pointgroup: C01 [X(C7H8Cl3N1Si1)]
dipole: -0.3227911 0.0016542 -0.0675467 debye
dipolederiv: -0.6171594 -0.0002826 -0.2055483 0.0000853 -0.2994901 0.0004178 -0.3392886 0.0001413 -0.6949508 -0.4528024 0.0693173 0.0455028 0.1552616 -0.6295141 -0.214342 0.1170899 -0.208893 -0.4500209 -0.4520013 -0.0690987 0.044463 -0.1550454 -0.6321631 0.2138013 0.1156538 0.2086982 -0.4483566 1.6540057 -0.0001252 0.1160615 -0.0003048 1.7388521 0.0000756 0.0869478 0.0000258 1.7610655 -0.3952676 -0.0001317 0.0126748 -0.0002684 -0.3645825 -0.0004397 0.0304942 -0.0003779 -0.2529727 -0.1803363 -0.0004892 -0.0535198 -0.0012743 0.1160881 -0.000163 0.1495682 0.0000855 0.1447035 -0.2350358 0.0000777 -0.0310974 -0.0000963 -0.2829458 0.0003321 -0.0438915 0.0001915 -0.3396995 0.4657244 0.0012411 -0.0660356 0.0019754 0.1291791 0.0006031 -0.1938033 0.0002674 -0.0664769 -0.3541424 -0.1761655 0.0135919 -0.0830616 -0.0409382 0.0261696 0.0416736 0.0502857 -0.1042698 -0.3558987 0.1742148 0.0151866 0.0805938 -0.0385142 -0.0255379 0.0427929 -0.0494703 -0.1049016 0.2549294 0.1948288 -0.0722458 0.044699 0.2764454 -0.0039713 -0.0739516 -0.0528807 -0.0428382 0.2565614 -0.1944055 -0.0739093 -0.0441239 0.2743795 0.0061909 -0.0746859 0.0550717 -0.0423337 0.0632741 0.0198411 0.027462 0.0265953 -0.0298326 -0.1020118 0.0129616 -0.052565 0.0242533 0.063366 -0.019615 0.0265807 -0.0261485 -0.0314195 0.1016734 0.0123059 0.0522608 0.0255581 0.0461537 0.0882002 0.0438135 -0.0146107 0.022857 -0.0702091 -0.0026732 -0.0529001 0.0377856 0.0466128 -0.0883105 0.0430318 0.0148316 0.0217131 0.0701596 -0.0025848 0.0528067 0.0386497 0.0584052 0.1070426 0.036551 0.0818467 -0.0381736 -0.0204824 0.0319837 -0.0302663 0.1296758 0.0596022 -0.1067373 0.0355319 -0.0814512 -0.0398363 0.0193064 0.0310806 0.0290433 0.1301092 0.037537 -0.084208 0.0205431 -0.0757084 -0.0767279 0.0159671 0.0287792 0.0227021 0.1276818 0.036472 0.0848056 0.0213616 0.0762047 -0.0753765 -0.0175398 0.0295474 -0.0242266 0.1273384 unknown
polarizability: 160.0403387|0.1135048|131.4707804|-3.7528819|0.123124|97.1466205 unknown
InChI: InChI=1S/C7H8Cl3NSi/c8-12(9,10)6-3-7-1-4-11-5-2-7/h1-2,4-5H,3,6H2
charge 0 multiplicity 1
20 atoms
Cl 4.153006 0.014857 1.996029
Cl 3.541742 -1.746366 -1.012019
Cl 3.535587 1.785794 -1.004939
Si 3.004401 0.016453 0.150302
N  -3.973945 -0.003902 0.418431
C  0.253495 0.014599 -0.760502
C  1.149624 0.012044 0.513852
C  -1.21872 0.008378 -0.376551
C  -1.923778 -1.20541 -0.178214
C  -1.931647 1.215871 -0.168221
C  -3.28114 -1.164119 0.213101
C  -3.288699 1.162452 0.222808
H  0.488005 -0.873276 -1.377064
H  0.482527 0.909097 -1.369409
H  0.933538 0.898736 1.139648
H  0.936766 -0.879732 1.133485
H  -1.430418 -2.171814 -0.333957
H  -1.444593 2.186733 -0.315852
H  -3.847449 -2.089484 0.368251
H  -3.861003 2.082786 0.385723
